program: Orca
programVersion: 5.0.2
elementType: O O O O N C C C C C C C C C C C C C C C C C C C C C C C C H H H H H H H H H H H H H H H H H H H H H H H H H
charge: 0
multiplicity: 1
keywords: wb97x-d3
keywords: def2-TZVPP
keywords: def2/J RIJCOSX
keywords: DEFGRID2
keywords: scfconv7
keywords: smallprint printgap noloewdin
keywords: NOSOSCF
formula: C24H25NO4
InChI: InChI=1/C24H25NO4/c1-23(2)19(21-24(3,4)29-21)20(23)22(26)28-18(14-25)15-9-8-12-17(13-15)27-16-10-6-5-7-11-16/h5-13,18-21H,1-4H3
54 atoms
O  -2.710594 3.256021 -1.068491
O  -1.85954 -1.92741 0.179858
O  -2.563933 -0.159397 1.344182
O  2.877124 -0.32492 -0.851859
N  -0.311041 -4.757855 0.865547
C  -3.616716 0.956729 -1.255647
C  -4.744072 0.064956 -0.870124
C  -3.329509 -0.498688 -0.903436
C  -3.105787 2.066543 -0.392331
C  -1.703052 2.484862 -0.410297
C  -5.489446 0.236306 0.429863
C  -5.634308 -0.424268 -1.988789
C  -2.581283 -0.800174 0.323642
C  -1.107781 3.109767 0.821575
C  -0.705974 1.812643 -1.315309
C  -1.010608 -2.273467 1.268469
C  0.208723 -1.383737 1.340851
C  -0.630145 -3.666868 1.028592
C  1.046271 -1.277566 0.238567
C  0.464464 -0.65404 2.492684
C  2.136811 -0.420386 0.286731
C  1.559927 0.195338 2.528594
C  2.394608 0.328792 1.430059
C  4.187248 0.075792 -0.798355
C  4.583071 1.087957 -1.65903
C  5.104612 -0.547526 0.038221
C  5.914509 1.480015 -1.682706
C  6.428898 -0.136137 0.014278
C  6.839991 0.87588 -0.843837
H  -3.522348 1.157822 -2.318041
H  -3.10558 -1.155606 -1.735387
H  -3.666121 2.257573 0.520679
H  -5.910422 -0.718174 0.750717
H  -4.890134 0.62118 1.250143
H  -6.321875 0.926754 0.282346
H  -5.085071 -0.556644 -2.921885
H  -6.43715 0.291644 -2.175538
H  -6.094082 -1.38084 -1.733566
H  -1.868984 3.557319 1.461489
H  -0.384484 3.884291 0.558429
H  -0.580973 2.354182 1.407082
H  -1.156813 1.416347 -2.224218
H  -0.217836 0.987715 -0.794658
H  0.075318 2.516398 -1.610373
H  -1.553524 -2.242943 2.21834
H  0.856854 -1.845515 -0.665625
H  -0.190615 -0.739249 3.349992
H  1.760758 0.776769 3.418628
H  3.230143 1.015295 1.47273
H  3.856514 1.560469 -2.30827
H  4.794438 -1.346272 0.700776
H  6.224486 2.267644 -2.357207
H  7.144695 -0.617888 0.667887
H  7.875763 1.188458 -0.859985
elementType: O N C H
totalener: -1285.32854325 hartree
nucrepener: 2734.64825585 hartree
electener: -4019.97679911 hartree
oneelecener: -7183.27533091 hartree
twoeener: 3163.29853181 hartree
cpcmener: -0.03434832 hartree
kineticenergy: 1279.68095920 hartree
xcener: -124.707418483175 hartree
chargesum: 0.0000000
charge: -0.457302 -0.283118 -0.445536 -0.328106 -0.087462 -0.102936 0.080535 -0.061187 0.119009 0.215517 -0.286506 -0.258423 0.343601 -0.253146 -0.257342 0.434291 0.017359 -0.231882 -0.248960 -0.186608 0.263538 -0.154005 -0.164098 0.257179 -0.228430 -0.186214 -0.131750 -0.148401 -0.170724 0.105924 0.092471 0.116330 0.101634 0.093799 0.102676 0.088747 0.097180 0.097026 0.094397 0.100469 0.076121 0.101299 0.051193 0.109588 0.136715 0.133895 0.143040 0.160284 0.156732 0.147213 0.158170 0.158013 0.159544 0.158646
qa: -0.4573 -0.2831 -0.4455 -0.3281 -0.0875 -0.1029 0.0805 -0.0612 0.1190 0.2155 -0.2865 -0.2584 0.3436 -0.2531 -0.2573 0.4343 0.0174 -0.2319 -0.2490 -0.1866 0.2635 -0.1540 -0.1641 0.2572 -0.2284 -0.1862 -0.1317 -0.1484 -0.1707 0.1059 0.0925 0.1163 0.1016 0.0938 0.1027 0.0887 0.0972 0.0970 0.0944 0.1005 0.0761 0.1013 0.0512 0.1096 0.1367 0.1339 0.1430 0.1603 0.1567 0.1472 0.1582 0.1580 0.1595 0.1586
va: 1.9532 2.1325 2.0524 2.0584 3.1143 3.8222 3.8210 3.8537 3.9302 3.7846 3.8990 3.8939 4.1316 3.9424 3.9425 3.7255 3.5888 4.0785 3.9967 3.9343 3.7134 3.9129 3.8794 3.7164 4.0001 3.9246 3.8902 3.8902 3.8958 1.0195 1.0303 0.9992 0.9996 1.0195 0.9987 1.0048 1.0019 1.0023 1.0092 1.0046 1.0062 1.0074 1.0242 1.0052 1.0161 1.0290 1.0069 0.9916 0.9960 1.0062 0.9962 0.9898 0.9902 0.9901
dispcorr: -0.030502454 hartree
energy: -1285.359045704997
dipole: -14.22511 14.50089 0.27578 15.43249 -14.54123 0.89125 -3.63614 4.07390 0.43776
magnitude: 1.03055 au
magnitude: 2.61944 debye
