program: Orca
programVersion: 5.0.2
elementType: O O O O N C C C C C C C C C C C C C C C C C C C C C C C C H H H H H H H H H H H H H H H H H H H H H H H H H
charge: 0
multiplicity: 1
keywords: wb97x-d3
keywords: def2-TZVPP
keywords: def2/J RIJCOSX
keywords: DEFGRID2
keywords: scfconv7
keywords: smallprint printgap noloewdin
keywords: NOSOSCF
formula: C24H25NO4
InChI: InChI=1/C24H25NO4/c1-23(2)19(21-24(3,4)29-21)20(23)22(26)28-18(14-25)15-9-8-12-17(13-15)27-16-10-6-5-7-11-16/h5-13,18-21H,1-4H3
54 atoms
O  -2.46027 2.859899 -1.937977
O  -1.806132 -1.719933 0.888025
O  -1.256887 0.42474 1.196201
O  3.808352 -0.96291 -0.758287
N  -0.763359 -4.527464 2.273816
C  -3.607522 1.155462 -0.565206
C  -4.345165 0.854957 0.692552
C  -3.341887 -0.157163 0.157316
C  -2.589606 2.248911 -0.657897
C  -1.338964 2.149018 -1.412901
C  -4.066627 1.617377 1.963823
C  -5.790915 0.438908 0.561454
C  -2.043764 -0.396053 0.799301
C  -0.178919 3.009061 -0.988486
C  -0.960072 0.89665 -2.155736
C  -0.505684 -2.116803 1.299105
C  0.452928 -2.118646 0.130774
C  -0.664352 -3.467946 1.841834
C  1.679845 -1.48362 0.247873
C  0.091747 -2.756011 -1.052322
C  2.55695 -1.499694 -0.831815
C  0.973485 -2.755499 -2.119704
C  2.205246 -2.125375 -2.018066
C  4.006821 0.240633 -0.135968
C  3.174894 1.328055 -0.369063
C  5.115149 0.35694 0.689697
C  3.461271 2.541076 0.239838
C  5.394829 1.579461 1.283949
C  4.569665 2.673792 1.065735
H  -4.171546 1.017236 -1.482453
H  -3.77472 -1.040735 -0.296432
H  -2.603982 2.964988 0.163304
H  -4.329706 1.009623 2.831482
H  -3.032338 1.929272 2.08547
H  -4.684822 2.516611 1.995334
H  -6.441644 1.315493 0.572978
H  -6.090062 -0.208238 1.388022
H  -5.977858 -0.099157 -0.368645
H  0.45711 3.265264 -1.838279
H  0.432814 2.475973 -0.260422
H  -0.51341 3.937315 -0.523597
H  -0.243961 0.31039 -1.577813
H  -0.475971 1.151846 -3.101044
H  -1.815204 0.259833 -2.380505
H  -0.125346 -1.48393 2.106835
H  1.952653 -0.995543 1.176334
H  -0.865648 -3.253609 -1.143166
H  0.701118 -3.246862 -3.044395
H  2.895923 -2.125399 -2.851885
H  2.318864 1.236849 -1.026617
H  5.755583 -0.499715 0.858988
H  2.815111 3.390445 0.057177
H  6.261639 1.671316 1.925701
H  4.788895 3.624282 1.533942
elementType: O N C H
totalener: -1285.32751095 hartree
nucrepener: 2778.64456263 hartree
electener: -4063.97207358 hartree
oneelecener: -7270.78451672 hartree
twoeener: 3206.81244315 hartree
cpcmener: -0.03448988 hartree
kineticenergy: 1279.68103097 hartree
xcener: -124.706517544369 hartree
chargesum: -0.0000000
charge: -0.458221 -0.281949 -0.445730 -0.329539 -0.087020 -0.076194 0.100476 -0.109838 0.079586 0.267131 -0.295301 -0.258269 0.365374 -0.294373 -0.257178 0.415082 0.007863 -0.227761 -0.139193 -0.225345 0.224766 -0.134091 -0.195731 0.242196 -0.161362 -0.230475 -0.157785 -0.129129 -0.181254 0.108159 0.096406 0.115929 0.102621 0.093270 0.105125 0.096331 0.096881 0.088810 0.106322 0.076473 0.100647 0.032515 0.115414 0.107378 0.135944 0.145133 0.146161 0.159267 0.148759 0.173798 0.146356 0.159994 0.157387 0.158187
qa: -0.4582 -0.2819 -0.4457 -0.3295 -0.0870 -0.0762 0.1005 -0.1098 0.0796 0.2671 -0.2953 -0.2583 0.3654 -0.2944 -0.2572 0.4151 0.0079 -0.2278 -0.1392 -0.2253 0.2248 -0.1341 -0.1957 0.2422 -0.1614 -0.2305 -0.1578 -0.1291 -0.1813 0.1082 0.0964 0.1159 0.1026 0.0933 0.1051 0.0963 0.0969 0.0888 0.1063 0.0765 0.1006 0.0325 0.1154 0.1074 0.1359 0.1451 0.1462 0.1593 0.1488 0.1738 0.1464 0.1600 0.1574 0.1582
va: 1.9451 2.1208 2.0480 2.0768 3.1135 3.8379 3.7906 3.8644 3.9436 3.7242 3.9084 3.8951 4.1247 3.9677 3.9515 3.7219 3.6032 4.0817 3.8896 3.9394 3.7681 3.9117 3.9886 3.7649 3.8909 3.9962 3.9082 3.8930 3.9289 1.0208 1.0292 0.9933 1.0004 1.0154 0.9976 1.0019 1.0022 1.0047 0.9961 1.0044 1.0124 1.0235 1.0065 1.0037 1.0253 1.0063 1.0119 0.9895 1.0042 0.9775 1.0074 0.9924 0.9889 0.9911
dispcorr: -0.031842251 hartree
energy: -1285.359353204627
dipole: -15.51971 15.23714 -0.28258 18.40137 -17.45369 0.94769 -3.16725 2.90355 -0.26370
magnitude: 1.02347 au
magnitude: 2.60146 debye
