program: Orca
programVersion: 5.0.2
elementType: O O O O N C C C C C C C C C C C C C C C C C C C C C C C C H H H H H H H H H H H H H H H H H H H H H H H H H
charge: 0
multiplicity: 1
keywords: wb97x-d3
keywords: def2-TZVPP
keywords: def2/J RIJCOSX
keywords: DEFGRID2
keywords: scfconv7
keywords: smallprint printgap noloewdin
keywords: NOSOSCF
formula: C24H25NO4
InChI: InChI=1/C24H25NO4/c1-23(2)19(21-24(3,4)29-21)20(23)22(26)28-18(14-25)15-9-8-12-17(13-15)27-16-10-6-5-7-11-16/h5-13,18-21H,1-4H3
54 atoms
O  -2.299075 3.463605 -0.096387
O  -1.801168 -1.891095 -0.208332
O  -2.52468 -0.430747 1.319706
O  3.310336 -1.107906 -0.695599
N  -0.693403 -4.996547 -0.076765
C  -3.306624 1.377894 -0.960798
C  -4.48474 0.468909 -0.939477
C  -3.085192 -0.129096 -0.990739
C  -2.89607 2.208568 0.214859
C  -1.497312 2.477438 0.554544
C  -5.350511 0.32698 0.287554
C  -5.268625 0.334763 -2.223746
C  -2.476138 -0.789069 0.16999
C  -1.137878 2.787656 1.982222
C  -0.369956 1.91077 -0.265533
C  -1.062479 -2.56553 0.806113
C  0.251095 -1.873868 1.080143
C  -0.857956 -3.922876 0.295952
C  1.200148 -1.775363 0.069024
C  0.47945 -1.2863 2.315734
C  2.388485 -1.103676 0.308724
C  1.671163 -0.610776 2.539526
C  2.631696 -0.516175 1.546039
C  4.100141 -0.011468 -0.91793
C  3.591247 1.28106 -0.894483
C  5.431027 -0.244534 -1.233434
C  4.434213 2.345265 -1.180616
C  6.259708 0.829054 -1.527726
C  5.768812 2.126965 -1.496151
H  -3.096702 1.851365 -1.914833
H  -2.791269 -0.54816 -1.945655
H  -3.617699 2.262736 1.028697
H  -6.128618 1.092739 0.273997
H  -5.848179 -0.644424 0.286537
H  -4.819148 0.420518 1.23062
H  -4.632748 0.432078 -3.1044
H  -6.036341 1.108964 -2.282424
H  -5.768483 -0.63412 -2.27809
H  -1.989126 3.175709 2.54275
H  -0.334311 3.525763 2.030401
H  -0.786763 1.887072 2.488307
H  -0.659162 1.686941 -1.291723
H  0.006648 0.992258 0.187921
H  0.460928 2.619232 -0.300226
H  -1.64473 -2.652067 1.728766
H  1.031325 -2.22436 -0.903588
H  -0.263167 -1.355048 3.099995
H  1.858281 -0.155382 3.503016
H  3.562077 0.001589 1.742109
H  2.548904 1.463022 -0.663082
H  5.811527 -1.258212 -1.254267
H  4.038357 3.352571 -1.161126
H  7.297349 0.645475 -1.775404
H  6.41969 2.961955 -1.719703
elementType: O N C H
totalener: -1285.32865152 hartree
nucrepener: 2750.48177433 hartree
electener: -4035.81042585 hartree
oneelecener: -7214.57851523 hartree
twoeener: 3178.76808938 hartree
cpcmener: -0.03416813 hartree
kineticenergy: 1279.67359769 hartree
xcener: -124.705951689949 hartree
chargesum: -0.0000000
charge: -0.459131 -0.280282 -0.447697 -0.326013 -0.087725 -0.084982 0.092580 -0.093312 0.092741 0.246145 -0.292486 -0.258341 0.363636 -0.264215 -0.248621 0.425968 0.009053 -0.232033 -0.215786 -0.194122 0.232718 -0.132943 -0.167003 0.202653 -0.118620 -0.200772 -0.203517 -0.148869 -0.149163 0.107064 0.093933 0.115653 0.103896 0.101159 0.093797 0.089064 0.096257 0.096541 0.094792 0.100737 0.083621 0.108383 0.021841 0.113297 0.136256 0.134556 0.144100 0.161151 0.156750 0.171771 0.145843 0.154665 0.157103 0.157908
qa: -0.4591 -0.2803 -0.4477 -0.3260 -0.0877 -0.0850 0.0926 -0.0933 0.0927 0.2461 -0.2925 -0.2583 0.3636 -0.2642 -0.2486 0.4260 0.0091 -0.2320 -0.2158 -0.1941 0.2327 -0.1329 -0.1670 0.2027 -0.1186 -0.2008 -0.2035 -0.1489 -0.1492 0.1071 0.0939 0.1157 0.1039 0.1012 0.0938 0.0891 0.0963 0.0965 0.0948 0.1007 0.0836 0.1084 0.0218 0.1133 0.1363 0.1346 0.1441 0.1612 0.1567 0.1718 0.1458 0.1547 0.1571 0.1579
va: 1.9454 2.1336 2.0495 2.0827 3.1137 3.8211 3.7966 3.8628 3.9588 3.7375 3.9048 3.8950 4.1191 3.9472 3.9491 3.7290 3.5944 4.0742 4.0224 3.9130 3.8045 3.8825 3.8988 3.7677 3.8325 3.9645 3.9544 3.9074 3.8742 1.0208 1.0305 0.9961 0.9979 1.0003 1.0175 1.0048 1.0017 1.0023 1.0082 1.0030 1.0057 1.0039 1.0316 1.0020 1.0169 1.0250 1.0096 0.9903 0.9952 0.9714 1.0074 0.9946 0.9897 0.9901
dispcorr: -0.031145212 hartree
energy: -1285.359796734355
dipole: -14.41045 14.44254 0.03208 19.07330 -17.82277 1.25053 -0.30217 0.76643 0.46427
magnitude: 1.33432 au
magnitude: 3.39157 debye
