program: Orca
programVersion: 5.0.2
elementType: O O O O N C C C C C C C C C C C C C C C C C C C C C C C C H H H H H H H H H H H H H H H H H H H H H H H H H
charge: 0
multiplicity: 1
keywords: wb97x-d3
keywords: def2-TZVPP
keywords: def2/J RIJCOSX
keywords: DEFGRID2
keywords: scfconv7
keywords: smallprint printgap noloewdin
keywords: NOSOSCF
formula: C24H25NO4
InChI: InChI=1/C24H25NO4/c1-23(2)19(21-24(3,4)29-21)20(23)22(26)28-18(14-25)15-9-8-12-17(13-15)27-16-10-6-5-7-11-16/h5-13,18-21H,1-4H3
54 atoms
O  -4.921321 1.432501 -1.184614
O  -0.815005 -1.184585 1.05964
O  -1.205469 -0.48962 -1.021702
O  4.215543 -0.548744 0.283987
N  -2.153623 -3.703234 -0.761819
C  -2.894787 1.703462 0.207002
C  -1.547355 2.328964 0.287692
C  -1.748069 0.924428 0.841142
C  -3.51247 1.254101 -1.079548
C  -4.409479 0.099439 -1.165037
C  -0.71538 2.577839 -0.945326
C  -1.350243 3.386167 1.34861
C  -1.239177 -0.271143 0.162642
C  -4.516455 -0.649246 -2.465559
C  -4.753681 -0.711017 0.05547
C  -0.299475 -2.401315 0.546486
C  0.996526 -2.223249 -0.216175
C  -1.334332 -3.110652 -0.216734
C  1.987342 -1.455082 0.385019
C  1.227385 -2.826252 -1.443998
C  3.198478 -1.271946 -0.266733
C  2.455876 -2.659277 -2.067402
C  3.442334 -1.876462 -1.492709
C  3.9455 0.602409 0.975191
C  3.007056 1.527352 0.531833
C  4.695714 0.845171 2.117021
C  2.82012 2.697733 1.252594
C  4.505055 2.025696 2.821167
C  3.564346 2.953773 2.397007
H  -3.619698 2.050881 0.936205
H  -1.767105 0.847087 1.921701
H  -2.973575 1.526918 -1.984996
H  -0.98266 3.545373 -1.374133
H  0.343488 2.619377 -0.681823
H  -0.826801 1.83158 -1.726711
H  -1.616021 4.370859 0.959034
H  -0.308133 3.425465 1.671943
H  -1.965799 3.201391 2.22996
H  -5.533133 -1.015458 -2.62354
H  -3.853278 -1.515811 -2.457643
H  -4.244118 -0.026204 -3.318205
H  -5.77526 -1.090508 -0.01758
H  -4.675436 -0.140607 0.980229
H  -4.093535 -1.576141 0.135062
H  -0.109051 -3.008151 1.43593
H  1.816812 -1.00245 1.35468
H  0.464697 -3.424098 -1.925806
H  2.638767 -3.130755 -3.02398
H  4.394557 -1.733594 -1.987653
H  2.42702 1.346695 -0.365231
H  5.425678 0.116523 2.44789
H  2.089457 3.418984 0.908066
H  5.09302 2.213849 3.710513
H  3.413809 3.870611 2.951602
elementType: O N C H
totalener: -1285.32673805 hartree
nucrepener: 2792.38674534 hartree
electener: -4077.71348339 hartree
oneelecener: -7298.84701367 hartree
twoeener: 3221.13353028 hartree
cpcmener: -0.03581026 hartree
kineticenergy: 1279.67948735 hartree
xcener: -124.710168973865 hartree
chargesum: -0.0000000
charge: -0.456637 -0.295404 -0.441968 -0.329364 -0.098237 -0.103785 0.094739 -0.070282 0.101290 0.216679 -0.290188 -0.256577 0.372735 -0.250817 -0.280715 0.554983 -0.037289 -0.260723 -0.251294 -0.196742 0.261622 -0.110398 -0.234526 0.281088 -0.184031 -0.251581 -0.139245 -0.114006 -0.201943 0.106633 0.093007 0.119503 0.110689 0.082630 0.097905 0.098574 0.091932 0.090530 0.099399 0.082164 0.091591 0.108223 0.098516 0.088264 0.145469 0.143154 0.133110 0.159404 0.147607 0.159916 0.145217 0.164163 0.157796 0.157221
qa: -0.4566 -0.2954 -0.4420 -0.3294 -0.0982 -0.1038 0.0947 -0.0703 0.1013 0.2167 -0.2902 -0.2566 0.3727 -0.2508 -0.2807 0.5550 -0.0373 -0.2607 -0.2513 -0.1967 0.2616 -0.1104 -0.2345 0.2811 -0.1840 -0.2516 -0.1392 -0.1140 -0.2019 0.1066 0.0930 0.1195 0.1107 0.0826 0.0979 0.0986 0.0919 0.0905 0.0994 0.0822 0.0916 0.1082 0.0985 0.0883 0.1455 0.1432 0.1331 0.1594 0.1476 0.1599 0.1452 0.1642 0.1578 0.1572
va: 1.9498 2.1188 2.0480 2.0839 3.0800 3.8338 3.7896 3.8825 3.9407 3.7851 3.9004 3.8933 4.0543 3.9436 3.9645 3.7865 3.7306 4.0616 3.9618 3.9298 3.7448 3.9217 4.0192 3.7333 3.8936 4.0113 3.8672 3.8837 3.9448 1.0184 1.0312 0.9979 0.9994 1.0093 1.0203 1.0013 1.0062 1.0059 1.0038 1.0102 1.0076 1.0039 1.0030 1.0082 0.9879 1.0152 1.0191 0.9897 1.0050 0.9929 1.0080 0.9854 0.9882 0.9922
dispcorr: -0.031505942 hartree
energy: -1285.358243992969
dipole: -13.54336 15.28031 1.73695 16.01479 -15.10407 0.91072 -0.26445 2.02034 1.75589
magnitude: 2.63240 au
magnitude: 6.69103 debye
