program: Orca
programVersion: 5.0.2
elementType: O O O O N C C C C C C C C C C C C C C C C C C C C C C C C H H H H H H H H H H H H H H H H H H H H H H H H H
charge: 0
multiplicity: 1
keywords: wb97x-d3
keywords: def2-TZVPP
keywords: def2/J RIJCOSX
keywords: DEFGRID2
keywords: scfconv7
keywords: smallprint printgap noloewdin
keywords: NOSOSCF
formula: C24H25NO4
InChI: InChI=1/C24H25NO4/c1-23(2)19(21-24(3,4)29-21)20(23)22(26)28-18(14-25)15-9-8-12-17(13-15)27-16-10-6-5-7-11-16/h5-13,18-21H,1-4H3
54 atoms
O  -1.48414 3.643743 1.593137
O  -1.266343 -1.44526 -0.309479
O  -2.164245 -0.464496 1.496577
O  3.677742 -0.700291 -0.426994
N  -2.166583 -4.634805 -0.307598
C  -2.33376 2.076858 -0.117643
C  -3.530464 1.371381 -0.649437
C  -2.187741 0.649345 -0.625514
C  -2.166511 2.42078 1.329302
C  -0.867429 2.423717 2.003522
C  -4.658681 0.943481 0.25543
C  -4.004704 1.76652 -2.027366
C  -1.902655 -0.433673 0.322184
C  -0.815964 2.204147 3.491224
C  0.392923 2.055386 1.269318
C  -0.79969 -2.540557 0.453411
C  0.693299 -2.718942 0.253959
C  -1.560174 -3.717216 0.021119
C  1.470602 -1.604318 -0.03445
C  1.285414 -3.962661 0.426635
C  2.844872 -1.746276 -0.173079
C  2.661903 -4.084534 0.299564
C  3.447546 -2.987305 -0.007953
C  3.216551 0.463217 -0.985856
C  3.592669 1.651329 -0.377322
C  2.464096 0.469769 -2.154338
C  3.211442 2.859621 -0.944306
C  2.075069 1.684333 -2.700281
C  2.44631 2.881869 -2.101664
H  -1.882201 2.803316 -0.786057
H  -1.704417 0.534686 -1.588682
H  -3.044388 2.271312 1.955438
H  -5.371051 1.76332 0.363583
H  -5.194773 0.101388 -0.185712
H  -4.351694 0.646263 1.254504
H  -3.181371 2.075363 -2.672287
H  -4.704892 2.601724 -1.96234
H  -4.520772 0.938265 -2.516649
H  -1.752968 2.481325 3.975825
H  -0.013403 2.788727 3.945664
H  -0.623083 1.15372 3.713222
H  1.228728 2.657199 1.630218
H  0.316332 2.201887 0.193224
H  0.646717 1.011417 1.454321
H  -1.010113 -2.39439 1.518041
H  1.014069 -0.631627 -0.152351
H  0.691164 -4.837792 0.658592
H  3.127453 -5.05233 0.431787
H  4.520279 -3.087403 -0.116141
H  4.184224 1.629442 0.529809
H  2.183908 -0.457977 -2.637969
H  3.508079 3.786063 -0.469498
H  1.485139 1.691032 -3.60787
H  2.143836 3.825094 -2.537283
elementType: O N C H
totalener: -1285.32728975 hartree
nucrepener: 2801.65904125 hartree
electener: -4086.98633099 hartree
oneelecener: -7316.57592608 hartree
twoeener: 3229.58959509 hartree
cpcmener: -0.03353424 hartree
kineticenergy: 1279.67395906 hartree
xcener: -124.709340483538 hartree
chargesum: -0.0000000
charge: -0.459928 -0.289647 -0.443437 -0.321484 -0.087970 -0.061892 0.093186 -0.114402 0.081436 0.248446 -0.290418 -0.256005 0.389115 -0.260203 -0.299912 0.426651 -0.002828 -0.218369 -0.199938 -0.235366 0.335064 -0.098978 -0.261376 0.287026 -0.221546 -0.189410 -0.155780 -0.155842 -0.152016 0.104860 0.092457 0.118013 0.105358 0.101774 0.093058 0.088782 0.096916 0.096816 0.092225 0.100331 0.089046 0.116207 0.076817 0.091235 0.134705 0.099516 0.137797 0.157967 0.144991 0.144620 0.157826 0.157267 0.159323 0.157920
qa: -0.4599 -0.2896 -0.4434 -0.3215 -0.0880 -0.0619 0.0932 -0.1144 0.0814 0.2484 -0.2904 -0.2560 0.3891 -0.2602 -0.2999 0.4267 -0.0028 -0.2184 -0.1999 -0.2354 0.3351 -0.0990 -0.2614 0.2870 -0.2215 -0.1894 -0.1558 -0.1558 -0.1520 0.1049 0.0925 0.1180 0.1054 0.1018 0.0931 0.0888 0.0969 0.0968 0.0922 0.1003 0.0890 0.1162 0.0768 0.0912 0.1347 0.0995 0.1378 0.1580 0.1450 0.1446 0.1578 0.1573 0.1593 0.1579
va: 1.9453 2.1210 2.0566 2.0984 3.1075 3.7833 3.8289 3.8418 3.9755 3.7741 3.9087 3.8905 4.1049 3.9434 3.9877 3.7194 3.7930 4.0527 3.9209 3.9962 3.6997 3.9109 4.0124 3.6545 3.9430 3.9021 3.8598 3.8736 3.8499 1.0224 1.0298 0.9960 0.9978 1.0007 1.0168 1.0047 1.0017 1.0026 1.0075 1.0029 1.0074 1.0033 1.0034 0.9961 1.0281 1.0218 1.0126 0.9895 1.0085 1.0089 0.9952 0.9908 0.9902 0.9901
dispcorr: -0.031599867 hartree
energy: -1285.358889612760
dipole: -11.40719 12.14394 0.73676 19.35331 -18.50448 0.84883 2.13015 -2.62942 -0.49927
magnitude: 1.22988 au
magnitude: 3.12610 debye
