program: Orca
programVersion: 5.0.2
elementType: O O O O N C C C C C C C C C C C C C C C C C C C C C C C C H H H H H H H H H H H H H H H H H H H H H H H H H
charge: 0
multiplicity: 1
keywords: wb97x-d3
keywords: def2-TZVPP
keywords: def2/J RIJCOSX
keywords: DEFGRID2
keywords: scfconv7
keywords: smallprint printgap noloewdin
keywords: NOSOSCF
formula: C24H25NO4
InChI: InChI=1/C24H25NO4/c1-23(2)19(21-24(3,4)29-21)20(23)22(26)28-18(14-25)15-9-8-12-17(13-15)27-16-10-6-5-7-11-16/h5-13,18-21H,1-4H3
54 atoms
O  -2.564861 3.582968 0.168847
O  -1.24595 -1.619581 -0.52745
O  -2.394356 -0.514468 1.033111
O  3.272816 0.555034 0.8885
N  0.528599 -4.393132 -0.699756
C  -3.074492 1.518794 -1.100465
C  -4.108628 0.484039 -1.370025
C  -2.644321 0.069133 -1.28059
C  -2.917651 2.204698 0.219373
C  -1.616361 2.659854 0.710294
C  -5.105047 0.065356 -0.318031
C  -4.682912 0.442209 -2.766552
C  -2.122055 -0.677868 -0.129241
C  -1.387579 2.762146 2.193333
C  -0.367139 2.461364 -0.105188
C  -0.6497 -2.39626 0.503683
C  0.355943 -1.619824 1.322179
C  0.005656 -3.507367 -0.189024
C  1.371044 -0.922458 0.67656
C  0.246407 -1.600526 2.703628
C  2.281118 -0.19925 1.435668
C  1.165499 -0.874692 3.448387
C  2.183045 -0.175659 2.823004
C  3.762004 0.256362 -0.358259
C  3.75649 1.259043 -1.315098
C  4.306728 -0.991507 -0.632956
C  4.314347 1.010671 -2.562364
C  4.848644 -1.230161 -1.886883
C  4.856182 -0.232837 -2.854165
H  -2.806535 2.144397 -1.946015
H  -2.166871 -0.173783 -2.222316
H  -3.67665 1.980096 0.96628
H  -5.984105 0.710174 -0.372617
H  -5.438745 -0.957833 -0.500418
H  -4.732921 0.10975 0.701584
H  -5.535349 1.11968 -2.847444
H  -5.031394 -0.561622 -3.016632
H  -3.951828 0.73953 -3.519332
H  -0.748736 3.614163 2.434541
H  -0.886884 1.863322 2.557457
H  -2.322181 2.870636 2.744559
H  0.331099 3.284296 0.063016
H  -0.561895 2.402789 -1.175312
H  0.138471 1.542248 0.194388
H  -1.412801 -2.826643 1.160624
H  1.439829 -0.936123 -0.405032
H  -0.552687 -2.14062 3.194728
H  1.088106 -0.852043 4.527329
H  2.899482 0.393253 3.402188
H  3.329664 2.226934 -1.082583
H  4.313796 -1.767217 0.123326
H  4.317999 1.794524 -3.308973
H  5.273599 -2.201516 -2.104527
H  5.285761 -0.424248 -3.828728
elementType: O N C H
totalener: -1285.32869032 hartree
nucrepener: 2784.63070671 hartree
electener: -4069.95939703 hartree
oneelecener: -7283.30797187 hartree
twoeener: 3213.34857484 hartree
cpcmener: -0.03467392 hartree
kineticenergy: 1279.68335577 hartree
xcener: -124.707340279530 hartree
chargesum: -0.0000000
charge: -0.457373 -0.286971 -0.443289 -0.325335 -0.087654 -0.100925 0.082893 -0.067768 0.112876 0.223115 -0.288904 -0.257265 0.347052 -0.249292 -0.271785 0.433869 0.020498 -0.230721 -0.213345 -0.197547 0.246228 -0.120696 -0.229494 0.264643 -0.227266 -0.182720 -0.133770 -0.144701 -0.169827 0.106350 0.093301 0.117092 0.103377 0.101948 0.093916 0.096667 0.096720 0.088686 0.100459 0.076763 0.092506 0.111521 0.101926 0.059542 0.139037 0.147103 0.142014 0.157839 0.147400 0.147994 0.156364 0.158236 0.159855 0.158856
qa: -0.4574 -0.2870 -0.4433 -0.3253 -0.0877 -0.1009 0.0829 -0.0678 0.1129 0.2231 -0.2889 -0.2573 0.3471 -0.2493 -0.2718 0.4339 0.0205 -0.2307 -0.2133 -0.1975 0.2462 -0.1207 -0.2295 0.2646 -0.2273 -0.1827 -0.1338 -0.1447 -0.1698 0.1063 0.0933 0.1171 0.1034 0.1019 0.0939 0.0967 0.0967 0.0887 0.1005 0.0768 0.0925 0.1115 0.1019 0.0595 0.1390 0.1471 0.1420 0.1578 0.1474 0.1480 0.1564 0.1582 0.1599 0.1589
va: 1.9517 2.1300 2.0539 2.0669 3.1140 3.8166 3.8163 3.8510 3.9387 3.7884 3.9005 3.8938 4.1302 3.9463 3.9512 3.7233 3.6008 4.0820 3.8691 3.9512 3.7180 3.9048 3.9897 3.7047 3.9961 3.9318 3.8920 3.8908 3.8994 1.0194 1.0299 0.9983 0.9987 0.9995 1.0197 1.0020 1.0022 1.0048 1.0044 1.0050 1.0085 1.0048 1.0052 1.0176 1.0170 1.0186 1.0051 0.9897 1.0061 1.0063 0.9977 0.9898 0.9899 0.9901
dispcorr: -0.031041501 hartree
energy: -1285.359731820160
dipole: -16.37730 15.98691 -0.39039 13.47035 -13.31995 0.15040 -4.03191 3.94082 -0.09109
magnitude: 0.42816 au
magnitude: 1.08829 debye
