program: Orca
programVersion: 5.0.2
elementType: O O O O N C C C C C C C C C C C C C C C C C C C C C C C C H H H H H H H H H H H H H H H H H H H H H H H H H
charge: 0
multiplicity: 1
keywords: wb97x-d3
keywords: def2-TZVPP
keywords: def2/J RIJCOSX
keywords: DEFGRID2
keywords: scfconv7
keywords: smallprint printgap noloewdin
keywords: NOSOSCF
formula: C24H25NO4
InChI: InChI=1/C24H25NO4/c1-23(2)19(21-24(3,4)29-21)20(23)22(26)28-18(14-25)15-9-8-12-17(13-15)27-16-10-6-5-7-11-16/h5-13,18-21H,1-4H3
54 atoms
O  -2.234277 3.831223 0.612403
O  -1.215911 -1.358402 0.02936
O  -2.190351 -0.242526 1.699422
O  4.097692 -1.142392 -0.689878
N  -1.740711 -4.007092 2.049048
C  -3.080019 1.749042 -0.42003
C  -4.184271 0.753681 -0.470623
C  -2.745024 0.269685 -0.579135
C  -2.699341 2.50019 0.816699
C  -1.31306 2.863959 1.117172
C  -5.029347 0.442911 0.739453
C  -4.965863 0.672382 -1.761084
C  -2.066202 -0.432985 0.516028
C  -0.901397 3.055663 2.551261
C  -0.192258 2.483643 0.186314
C  -0.3930 -2.045705 0.966098
C  0.83042 -2.514925 0.223819
C  -1.156487 -3.14245 1.569779
C  1.894533 -1.626827 0.140287
C  0.890559 -3.746894 -0.413342
C  3.01784 -1.970363 -0.598168
C  2.030347 -4.08661 -1.127723
C  3.093051 -3.202925 -1.231558
C  3.894435 0.206577 -0.83266
C  4.682988 1.057758 -0.073762
C  2.968732 0.710689 -1.73882
C  4.543483 2.430666 -0.226248
C  2.833237 2.084345 -1.873163
C  3.616195 2.94903 -1.119125
H  -2.917055 2.31412 -1.332364
H  -2.425843 -0.037014 -1.567748
H  -3.379372 2.403963 1.661203
H  -4.508628 0.518682 1.689344
H  -5.875625 1.131555 0.775365
H  -5.43349 -0.568242 0.667188
H  -5.400255 -0.320135 -1.893264
H  -4.343497 0.882798 -2.631546
H  -5.783345 1.395873 -1.755797
H  -0.141413 3.834592 2.639434
H  -0.474026 2.133114 2.946449
H  -1.745477 3.33096 3.183915
H  -0.512567 2.402439 -0.851466
H  0.241001 1.526794 0.481887
H  0.607404 3.225858 0.232854
H  -0.092091 -1.381074 1.780835
H  1.842739 -0.673348 0.653193
H  0.064203 -4.444381 -0.357913
H  2.086875 -5.046921 -1.622457
H  3.976871 -3.466855 -1.7982
H  5.400331 0.649297 0.627008
H  2.361145 0.044361 -2.338505
H  5.159246 3.095831 0.365225
H  2.112531 2.478702 -2.577893
H  3.505214 4.019615 -1.230147
elementType: O N C H
totalener: -1285.32918082 hartree
nucrepener: 2746.61599884 hartree
electener: -4031.94517966 hartree
oneelecener: -7206.60282094 hartree
twoeener: 3174.65764128 hartree
cpcmener: -0.03572671 hartree
kineticenergy: 1279.68872618 hartree
xcener: -124.706423332197 hartree
chargesum: -0.0000000
charge: -0.456221 -0.276685 -0.449925 -0.329782 -0.084227 -0.092999 0.090170 -0.065150 0.094803 0.245107 -0.289241 -0.257708 0.364804 -0.257546 -0.304792 0.390355 -0.003670 -0.231511 -0.162507 -0.187052 0.224561 -0.127696 -0.210209 0.258834 -0.236510 -0.166557 -0.114478 -0.162826 -0.184781 0.105153 0.092431 0.119423 0.094154 0.103122 0.101979 0.097065 0.088884 0.096500 0.099539 0.088857 0.092609 0.104220 0.076170 0.110144 0.130961 0.152454 0.141305 0.159296 0.149070 0.147131 0.155595 0.157717 0.160739 0.158921
qa: -0.4562 -0.2767 -0.4499 -0.3298 -0.0842 -0.0930 0.0902 -0.0651 0.0948 0.2451 -0.2892 -0.2577 0.3648 -0.2575 -0.3048 0.3904 -0.0037 -0.2315 -0.1625 -0.1871 0.2246 -0.1277 -0.2102 0.2588 -0.2365 -0.1666 -0.1145 -0.1628 -0.1848 0.1052 0.0924 0.1194 0.0942 0.1031 0.1020 0.0971 0.0889 0.0965 0.0995 0.0889 0.0926 0.1042 0.0762 0.1101 0.1310 0.1525 0.1413 0.1593 0.1491 0.1471 0.1556 0.1577 0.1607 0.1589
va: 1.9506 2.1321 2.0415 2.0749 3.1137 3.8134 3.8092 3.8559 3.9512 3.7818 3.9008 3.8937 4.0905 3.9413 3.9792 3.7591 3.7310 4.0600 3.9139 3.9668 3.7861 3.9284 4.0122 3.7016 4.0077 3.8624 3.8803 3.8524 3.8695 1.0205 1.0294 0.9969 1.0183 0.9981 0.9999 1.0023 1.0047 1.0021 1.0032 1.0067 1.0077 1.0002 1.0057 1.0022 1.0181 0.9980 1.0109 0.9898 1.0042 1.0070 0.9974 0.9884 0.9908 0.9903
dispcorr: -0.029901873 hartree
energy: -1285.359082693708
dipole: -14.86035 15.73894 0.87859 18.33662 -17.69191 0.64472 -2.62790 1.02615 -1.60175
magnitude: 1.93731 au
magnitude: 4.92426 debye
