program: Orca
programVersion: 5.0.2
elementType: O O O O N C C C C C C C C C C C C C C C C C C C C C C C C H H H H H H H H H H H H H H H H H H H H H H H H H
charge: 0
multiplicity: 1
keywords: wb97x-d3
keywords: def2-TZVPP
keywords: def2/J RIJCOSX
keywords: DEFGRID2
keywords: scfconv7
keywords: smallprint printgap noloewdin
keywords: NOSOSCF
formula: C24H25NO4
InChI: InChI=1/C24H25NO4/c1-23(2)19(21-24(3,4)29-21)20(23)22(26)28-18(14-25)15-9-8-12-17(13-15)27-16-10-6-5-7-11-16/h5-13,18-21H,1-4H3
54 atoms
O  -3.925844 2.072062 -1.947351
O  -1.147396 -0.646144 -0.520992
O  -1.819588 -1.682964 1.332507
O  3.619502 -0.91374 1.401797
N  0.044502 -1.410403 -3.490514
C  -2.75186 1.716178 0.199322
C  -1.505423 1.973183 0.970532
C  -2.224095 0.638618 1.138365
C  -2.784849 1.529098 -1.285051
C  -3.755829 0.651333 -1.939793
C  -0.158615 2.090941 0.299681
C  -1.621733 2.88262 2.171335
C  -1.720501 -0.665231 0.688797
C  -3.423136 0.043905 -3.274797
C  -4.756324 -0.126826 -1.128481
C  -0.593266 -1.861862 -0.995714
C  0.649323 -2.29943 -0.250027
C  -0.249115 -1.59373 -2.393653
C  1.542699 -1.346294 0.225415
C  0.899316 -3.652848 -0.09573
C  2.698092 -1.766227 0.868467
C  2.067978 -4.056376 0.537535
C  2.968307 -3.123731 1.019565
C  3.487786 0.448652 1.234949
C  3.672124 1.031452 -0.01093
C  3.230146 1.220989 2.356243
C  3.592965 2.411595 -0.128116
C  3.166586 2.602381 2.227971
C  3.342966 3.200062 0.988093
H  -3.645876 2.194672 0.586601
H  -2.771384 0.533385 2.067331
H  -1.851485 1.715681 -1.812987
H  0.023732 3.138171 0.052348
H  0.63032 1.7762 0.984709
H  -0.050537 1.520393 -0.618163
H  -1.49185 3.923917 1.871154
H  -0.852788 2.649852 2.909974
H  -2.593271 2.794079 2.658374
H  -3.08472 -0.984996 -3.147849
H  -2.637652 0.595496 -3.791678
H  -4.305179 0.019431 -3.917757
H  -5.031892 0.374384 -0.201766
H  -4.349319 -1.106644 -0.873797
H  -5.668245 -0.293424 -1.705061
H  -1.338646 -2.664576 -0.988917
H  1.332519 -0.293261 0.096175
H  0.193679 -4.38547 -0.465491
H  2.276498 -5.110394 0.662194
H  3.874433 -3.440128 1.520299
H  3.877529 0.417066 -0.878529
H  3.091632 0.748775 3.320473
H  3.735228 2.871202 -1.097197
H  2.972939 3.209786 3.102096
H  3.288682 4.276043 0.890615
elementType: O N C H
totalener: -1285.31541742 hartree
nucrepener: 2836.16342286 hartree
electener: -4121.47884028 hartree
oneelecener: -7385.69722511 hartree
twoeener: 3264.21838483 hartree
cpcmener: -0.04503382 hartree
kineticenergy: 1279.67074120 hartree
xcener: -124.710305990543 hartree
chargesum: -0.0000000
charge: -0.480604 -0.266219 -0.467926 -0.333096 -0.099145 -0.116072 0.149422 -0.105827 0.144463 0.227056 -0.319568 -0.270968 0.397045 -0.291165 -0.286025 0.375224 -0.000903 -0.229438 -0.188602 -0.229310 0.311443 -0.102221 -0.255314 0.249272 -0.173954 -0.176906 -0.151335 -0.154230 -0.167025 0.107368 0.094381 0.124250 0.117996 0.068238 0.096038 0.096696 0.096303 0.092616 0.085485 0.097235 0.109646 0.100798 0.095925 0.109010 0.154687 0.123198 0.145681 0.161087 0.149565 0.156565 0.148087 0.160714 0.159256 0.161103
qa: -0.4806 -0.2662 -0.4679 -0.3331 -0.0991 -0.1161 0.1494 -0.1058 0.1445 0.2271 -0.3196 -0.2710 0.3970 -0.2912 -0.2860 0.3752 -0.0009 -0.2294 -0.1886 -0.2293 0.3114 -0.1022 -0.2553 0.2493 -0.1740 -0.1769 -0.1513 -0.1542 -0.1670 0.1074 0.0944 0.1243 0.1180 0.0682 0.0960 0.0967 0.0963 0.0926 0.0855 0.0972 0.1096 0.1008 0.0959 0.1090 0.1547 0.1232 0.1457 0.1611 0.1496 0.1566 0.1481 0.1607 0.1593 0.1611
va: 1.9191 2.1082 2.0315 2.0864 3.1005 3.8564 3.7502 3.8785 3.8653 3.7278 3.9132 3.9027 4.1045 3.9588 3.9672 3.7334 3.6947 4.0594 3.9194 3.9947 3.7217 3.8901 3.9865 3.6865 3.8974 3.9498 3.8438 3.8625 3.8347 1.0193 1.0273 1.0025 0.9992 1.0077 1.0084 1.0015 1.0014 1.0055 1.0027 1.0031 1.0078 1.0015 1.0059 1.0021 1.0121 1.0329 1.0023 0.9878 1.0072 0.9972 1.0036 0.9900 0.9904 0.9903
dispcorr: -0.033808679 hartree
energy: -1285.349226101893
dipole: -13.72183 13.94481 0.22298 13.58873 -13.31091 0.27782 1.26912 0.01976 1.28887
magnitude: 1.33720 au
magnitude: 3.39889 debye
