program: Orca
programVersion: 5.0.2
elementType: O O O O N C C C C C C C C C C C C C C C C C C C C C C C C H H H H H H H H H H H H H H H H H H H H H H H H H
charge: 0
multiplicity: 1
keywords: wb97x-d3
keywords: def2-TZVPP
keywords: def2/J RIJCOSX
keywords: DEFGRID2
keywords: scfconv7
keywords: smallprint printgap noloewdin
keywords: NOSOSCF
formula: C24H25NO4
InChI: InChI=1/C24H25NO4/c1-23(2)19(21-24(3,4)29-21)20(23)22(26)28-18(14-25)15-9-8-12-17(13-15)27-16-10-6-5-7-11-16/h5-13,18-21H,1-4H3
54 atoms
O  -2.585532 3.420667 0.496545
O  -1.208058 -1.642885 -0.650443
O  -2.429516 -0.756169 0.993515
O  3.178147 0.695157 0.895394
N  0.767858 -4.246595 -1.063239
C  -3.102394 1.473036 -0.954679
C  -4.146274 0.470292 -1.295717
C  -2.685965 0.03716 -1.25753
C  -2.916801 2.035164 0.418039
C  -1.605232 2.460849 0.906701
C  -5.142545 -0.021699 -0.275791
C  -4.730765 0.545467 -2.686778
C  -2.140322 -0.792733 -0.177506
C  -1.320049 2.406807 2.382003
C  -0.387524 2.363576 0.02828
C  -0.552272 -2.460099 0.313529
C  0.403495 -1.683026 1.188507
C  0.178385 -3.45507 -0.472826
C  1.37424 -0.886192 0.592689
C  0.293341 -1.758206 2.568192
C  2.236391 -0.15643 1.398421
C  1.165069 -1.023326 3.360023
C  2.136989 -0.223398 2.78358
C  3.696019 0.479269 -0.361777
C  4.28404 -0.733618 -0.696539
C  3.667184 1.532143 -1.262224
C  4.845535 -0.885872 -1.955546
C  4.244577 1.370042 -2.514895
C  4.828839 0.16188 -2.8679
H  -2.834189 2.162906 -1.748194
H  -2.220846 -0.12553 -2.221913
H  -3.646275 1.728103 1.164228
H  -6.020556 0.626105 -0.290855
H  -5.475263 -1.029203 -0.529804
H  -4.774108 -0.045375 0.745493
H  -5.094026 -0.431452 -3.009673
H  -4.000539 0.891616 -3.418778
H  -5.574589 1.237418 -2.70506
H  -2.232976 2.439242 2.976837
H  -0.680259 3.236361 2.688473
H  -0.794346 1.480903 2.623488
H  0.090533 1.392218 0.156999
H  0.344652 3.124303 0.30631
H  -0.616865 2.487724 -1.028872
H  -1.276596 -2.999132 0.9325
H  1.443359 -0.827561 -0.487207
H  -0.468182 -2.379706 3.020923
H  1.087762 -1.073617 4.437685
H  2.815106 0.351905 3.400766
H  4.308285 -1.549867 0.014854
H  3.205044 2.470869 -0.983766
H  5.304184 -1.829346 -2.220647
H  4.227576 2.192205 -3.21816
H  5.272506 0.037374 -3.846548
elementType: O N C H
totalener: -1285.31788793 hartree
nucrepener: 2797.16102578 hartree
electener: -4082.47891371 hartree
oneelecener: -7308.42559066 hartree
twoeener: 3225.94667694 hartree
cpcmener: -0.04139937 hartree
kineticenergy: 1279.66911329 hartree
xcener: -124.707573312721 hartree
chargesum: -0.0000000
charge: -0.480293 -0.289478 -0.467233 -0.336379 -0.101127 -0.096653 0.077208 -0.056222 0.116406 0.224553 -0.286691 -0.258437 0.356828 -0.243513 -0.274099 0.450847 -0.005550 -0.227005 -0.180707 -0.195417 0.230592 -0.120057 -0.236133 0.279812 -0.190941 -0.237743 -0.146534 -0.133142 -0.177045 0.108362 0.094827 0.123362 0.102880 0.103357 0.092921 0.097187 0.090272 0.096976 0.096458 0.102787 0.066507 0.060563 0.111181 0.106191 0.142997 0.152157 0.148046 0.160687 0.148812 0.158368 0.151625 0.163319 0.162079 0.162232
qa: -0.4803 -0.2895 -0.4672 -0.3364 -0.1011 -0.0967 0.0772 -0.0562 0.1164 0.2246 -0.2867 -0.2584 0.3568 -0.2435 -0.2741 0.4508 -0.0056 -0.2270 -0.1807 -0.1954 0.2306 -0.1201 -0.2361 0.2798 -0.1909 -0.2377 -0.1465 -0.1331 -0.1770 0.1084 0.0948 0.1234 0.1029 0.1034 0.0929 0.0972 0.0903 0.0970 0.0965 0.1028 0.0665 0.0606 0.1112 0.1062 0.1430 0.1522 0.1480 0.1607 0.1488 0.1584 0.1516 0.1633 0.1621 0.1622
va: 1.9255 2.1295 2.0261 2.0486 3.1109 3.8136 3.8285 3.8570 3.9127 3.7851 3.8969 3.8932 4.1126 3.9411 3.9519 3.7078 3.6208 4.0907 3.8504 3.9322 3.7063 3.8904 3.9798 3.6802 3.9260 3.9952 3.8832 3.8834 3.8969 1.0188 1.0298 0.9982 0.9989 0.9993 1.0195 1.0020 1.0047 1.0019 1.0091 1.0052 1.0104 1.0164 1.0038 1.0068 1.0157 1.0164 1.0034 0.9888 1.0058 0.9971 1.0049 0.9887 0.9886 0.9890
dispcorr: -0.031791012 hartree
energy: -1285.349678941769
dipole: -16.55221 16.12858 -0.42363 12.92702 -12.87774 0.04928 -2.99147 2.86310 -0.12837
magnitude: 0.44539 au
magnitude: 1.13209 debye
