program: Orca
programVersion: 5.0.2
elementType: O O O O N C C C C C C C C C C C C C C C C C C C C C C C C H H H H H H H H H H H H H H H H H H H H H H H H H
charge: 0
multiplicity: 1
keywords: wb97x-d3
keywords: def2-TZVPP
keywords: def2/J RIJCOSX
keywords: DEFGRID2
keywords: scfconv7
keywords: smallprint printgap noloewdin
keywords: NOSOSCF
formula: C24H25NO4
InChI: InChI=1/C24H25NO4/c1-23(2)19(21-24(3,4)29-21)20(23)22(26)28-18(14-25)15-9-8-12-17(13-15)27-16-10-6-5-7-11-16/h5-13,18-21H,1-4H3
54 atoms
O  -3.081725 3.306068 -0.682446
O  -1.183516 -1.660756 -0.015663
O  -2.543541 -0.374053 1.203256
O  3.312504 1.032359 0.22662
N  0.886707 -4.154485 0.633853
C  -3.362326 0.949159 -1.384122
C  -4.267158 -0.230852 -1.390662
C  -2.773309 -0.443059 -1.182015
C  -3.344091 1.961693 -0.283301
C  -2.119417 2.641604 0.142476
C  -5.260623 -0.477518 -0.283007
C  -4.775411 -0.68965 -2.737191
C  -2.20346 -0.791042 0.123048
C  -2.017842 3.154083 1.552973
C  -0.798828 2.343244 -0.512567
C  -0.460436 -1.980828 1.169741
C  0.480246 -0.869768 1.569794
C  0.283028 -3.200378 0.852145
C  1.482721 -0.476165 0.690047
C  0.307097 -0.222504 2.783741
C  2.328006 0.562496 1.050561
C  1.150406 0.826806 3.121769
C  2.16314 1.220249 2.263595
C  3.989856 0.176665 -0.609111
C  4.444922 -1.064814 -0.181985
C  4.264222 0.633072 -1.889724
C  5.173773 -1.854601 -1.059208
C  5.006281 -0.162481 -2.751422
C  5.457229 -1.410215 -2.344164
H  -3.124664 1.364403 -2.358193
H  -2.237907 -0.857565 -2.027359
H  -4.142756 1.881266 0.451927
H  -4.945027 -0.133956 0.69765
H  -6.197032 0.030528 -0.520086
H  -5.47792 -1.54387 -0.205111
H  -5.014377 -1.754249 -2.720913
H  -4.044843 -0.521369 -3.528822
H  -5.685119 -0.147832 -3.002154
H  -1.499042 2.425608 2.178015
H  -2.998611 3.336418 1.99264
H  -1.447103 4.083786 1.590707
H  -0.179844 3.242085 -0.545594
H  -0.902607 1.969538 -1.530287
H  -0.252535 1.597486 0.066649
H  -1.137387 -2.220339 1.995352
H  1.598088 -0.974267 -0.265807
H  -0.477823 -0.533675 3.460498
H  1.022259 1.339923 4.065295
H  2.825202 2.034417 2.529015
H  4.241739 -1.417411 0.821412
H  3.906974 1.605077 -2.205255
H  5.527682 -2.822301 -0.728831
H  5.222522 0.195273 -3.749568
H  6.030093 -2.030184 -3.020558
elementType: O N C H
totalener: -1285.31831976 hartree
nucrepener: 2767.93268499 hartree
electener: -4053.25100475 hartree
oneelecener: -7249.96921795 hartree
twoeener: 3196.71821319 hartree
cpcmener: -0.04036085 hartree
kineticenergy: 1279.66732541 hartree
xcener: -124.707432917350 hartree
chargesum: 0.0000000
charge: -0.480622 -0.288955 -0.469083 -0.340291 -0.101850 -0.090318 0.087054 -0.080566 0.096768 0.230514 -0.290250 -0.258733 0.371256 -0.263758 -0.237062 0.449569 0.030498 -0.229816 -0.204025 -0.209232 0.262906 -0.123441 -0.231306 0.293019 -0.197806 -0.255371 -0.143496 -0.121924 -0.187732 0.108939 0.095780 0.124029 0.092413 0.104050 0.103481 0.096986 0.090900 0.097333 0.084486 0.096911 0.103033 0.113667 0.105295 0.026998 0.142232 0.147041 0.147353 0.162331 0.150019 0.157054 0.148600 0.162492 0.161634 0.160994
qa: -0.4806 -0.2890 -0.4691 -0.3403 -0.1018 -0.0903 0.0871 -0.0806 0.0968 0.2305 -0.2903 -0.2587 0.3713 -0.2638 -0.2371 0.4496 0.0305 -0.2298 -0.2040 -0.2092 0.2629 -0.1234 -0.2313 0.2930 -0.1978 -0.2554 -0.1435 -0.1219 -0.1877 0.1089 0.0958 0.1240 0.0924 0.1041 0.1035 0.0970 0.0909 0.0973 0.0845 0.0969 0.1030 0.1137 0.1053 0.0270 0.1422 0.1470 0.1474 0.1623 0.1500 0.1571 0.1486 0.1625 0.1616 0.1610
va: 1.9198 2.1312 2.0248 2.0593 3.1099 3.8303 3.8081 3.8644 3.9196 3.7516 3.9001 3.8933 4.1038 3.9452 3.9323 3.7145 3.5422 4.0844 3.8910 3.9080 3.7062 3.8727 3.9925 3.6727 3.9085 4.0128 3.8820 3.8755 3.9004 1.0198 1.0301 0.9966 1.0179 0.9982 0.9995 1.0023 1.0044 1.0016 1.0059 1.0086 1.0034 1.0058 1.0061 1.0382 1.0158 1.0137 1.0073 0.9880 1.0041 0.9976 1.0076 0.9892 0.9880 0.9896
dispcorr: -0.031132675 hartree
energy: -1285.349452438658
dipole: -18.16426 17.80093 -0.36333 9.77031 -9.69551 0.07480 -6.04923 6.06281 0.01358
magnitude: 0.37120 au
magnitude: 0.94351 debye
