program: Orca
programVersion: 5.0.2
elementType: O O O O N C C C C C C C C C C C C C C C C C C C C C C C C H H H H H H H H H H H H H H H H H H H H H H H H H
charge: 0
multiplicity: 1
keywords: wb97x-d3
keywords: def2-TZVPP
keywords: def2/J RIJCOSX
keywords: DEFGRID2
keywords: scfconv7
keywords: smallprint printgap noloewdin
keywords: NOSOSCF
formula: C24H25NO4
InChI: InChI=1/C24H25NO4/c1-23(2)19(21-24(3,4)29-21)20(23)22(26)28-18(14-25)15-9-8-12-17(13-15)27-16-10-6-5-7-11-16/h5-13,18-21H,1-4H3
54 atoms
O  -1.880912 3.409286 -0.121799
O  -1.992481 -1.962711 -0.144962
O  -2.227045 -0.467951 1.493451
O  2.905966 -0.755549 -1.034582
N  -0.834021 -5.01999 -0.503292
C  -3.284172 1.424299 -0.639153
C  -4.524586 0.698668 -0.256452
C  -3.282422 -0.100536 -0.632459
C  -2.427163 2.171333 0.330557
C  -0.986534 2.317747 0.123812
C  -5.061155 0.715186 1.153037
C  -5.622608 0.644907 -1.292225
C  -2.474176 -0.812411 0.363634
C  -0.087986 2.46133 1.320565
C  -0.321126 1.743552 -1.096602
C  -1.155149 -2.729365 0.713555
C  0.19356 -2.090586 0.948828
C  -0.991617 -4.011125 0.026004
C  0.957619 -1.683749 -0.136481
C  0.653465 -1.904441 2.243964
C  2.19213 -1.090765 0.081184
C  1.896995 -1.323297 2.445837
C  2.675408 -0.916723 1.37324
C  3.766358 0.314932 -1.030161
C  3.444505 1.525688 -0.429597
C  4.957487 0.16058 -1.723678
C  4.336731 2.583995 -0.52454
C  5.833785 1.232072 -1.820969
C  5.531666 2.444951 -1.217907
H  -3.272842 1.838088 -1.642137
H  -3.311043 -0.577805 -1.604257
H  -2.786236 2.212784 1.356201
H  -5.651651 -0.18319 1.339548
H  -4.30347 0.776158 1.928518
H  -5.723838 1.573586 1.274724
H  -6.236491 -0.247599 -1.160845
H  -5.224809 0.63262 -2.307534
H  -6.274912 1.515087 -1.199675
H  0.319261 1.485929 1.5953
H  -0.620897 2.857409 2.185555
H  0.754367 3.121778 1.10447
H  -0.986516 1.692825 -1.956887
H  0.03658 0.734978 -0.88818
H  0.545506 2.345215 -1.377099
H  -1.647923 -2.929768 1.670686
H  0.603897 -1.822631 -1.151673
H  0.048687 -2.212575 3.086985
H  2.268788 -1.182425 3.451842
H  3.647088 -0.474916 1.550788
H  2.511348 1.653403 0.104058
H  5.192196 -0.787824 -2.189657
H  4.086664 3.527246 -0.056872
H  6.761254 1.110859 -2.364736
H  6.219371 3.276703 -1.290496
elementType: O N C H
totalener: -1285.31791084 hartree
nucrepener: 2781.79124625 hartree
electener: -4067.10915709 hartree
oneelecener: -7277.28509921 hartree
twoeener: 3210.17594212 hartree
cpcmener: -0.04239990 hartree
kineticenergy: 1279.67666771 hartree
xcener: -124.710334374970 hartree
chargesum: -0.0000000
charge: -0.479805 -0.287398 -0.468757 -0.338149 -0.101565 -0.105686 0.077408 -0.054334 0.122455 0.226624 -0.286120 -0.257801 0.360232 -0.253069 -0.295949 0.445114 0.010722 -0.224249 -0.268477 -0.191875 0.266558 -0.134627 -0.183962 0.277829 -0.172427 -0.220973 -0.201677 -0.143937 -0.161508 0.108736 0.093927 0.124239 0.102535 0.093388 0.103409 0.097148 0.090567 0.096632 0.064940 0.108491 0.102537 0.110810 0.083253 0.109950 0.141811 0.144298 0.149034 0.163234 0.158228 0.168979 0.147662 0.159047 0.161061 0.161488
qa: -0.4798 -0.2874 -0.4688 -0.3381 -0.1016 -0.1057 0.0774 -0.0543 0.1225 0.2266 -0.2861 -0.2578 0.3602 -0.2531 -0.2959 0.4451 0.0107 -0.2242 -0.2685 -0.1919 0.2666 -0.1346 -0.1840 0.2778 -0.1724 -0.2210 -0.2017 -0.1439 -0.1615 0.1087 0.0939 0.1242 0.1025 0.0934 0.1034 0.0971 0.0906 0.0966 0.0649 0.1085 0.1025 0.1108 0.0833 0.1100 0.1418 0.1443 0.1490 0.1632 0.1582 0.1690 0.1477 0.1590 0.1611 0.1615
va: 1.9312 2.1306 2.0250 2.0646 3.1107 3.8145 3.8262 3.8581 3.9027 3.7500 3.8951 3.8926 4.1093 3.9492 3.9560 3.7026 3.5875 4.0903 3.9798 3.9525 3.7438 3.8937 3.8934 3.6616 3.8458 3.9851 3.9623 3.8959 3.8816 1.0183 1.0299 0.9998 0.9993 1.0196 0.9986 1.0024 1.0046 1.0020 1.0088 1.0082 1.0034 1.0080 1.0057 1.0021 1.0148 1.0250 1.0031 0.9896 0.9950 0.9695 1.0074 0.9936 0.9883 0.9889
dispcorr: -0.032370324 hartree
energy: -1285.350281164295
dipole: -12.21764 12.20259 -0.01506 18.75683 -17.80869 0.94814 1.28527 -0.52784 0.75743
magnitude: 1.21363 au
magnitude: 3.08480 debye
