program: Orca
programVersion: 5.0.2
elementType: O O O O N C C C C C C C C C C C C C C C C C C C C C C C C H H H H H H H H H H H H H H H H H H H H H H H H H
charge: 0
multiplicity: 1
keywords: wb97x-d3
keywords: def2-TZVPP
keywords: def2/J RIJCOSX
keywords: DEFGRID2
keywords: scfconv7
keywords: smallprint printgap noloewdin
keywords: NOSOSCF
formula: C24H25NO4
InChI: InChI=1/C24H25NO4/c1-23(2)19(21-24(3,4)29-21)20(23)22(26)28-18(14-25)15-9-8-12-17(13-15)27-16-10-6-5-7-11-16/h5-13,18-21H,1-4H3
54 atoms
O  -2.400377 2.89511 -1.65446
O  -2.159302 -1.914272 0.711915
O  -1.896127 0.171389 1.47273
O  2.851899 0.600918 0.625938
N  -1.073175 -4.878097 1.680746
C  -3.761731 1.043954 -0.735105
C  -4.752966 0.653639 0.302522
C  -3.654574 -0.329243 -0.077807
C  -2.722875 2.098415 -0.514957
C  -1.389899 2.036825 -1.116652
C  -4.781839 1.312815 1.658699
C  -6.12865 0.265084 -0.185227
C  -2.504776 -0.613283 0.787066
C  -0.246853 2.741515 -0.438648
C  -0.988371 0.875613 -1.983703
C  -0.941243 -2.290011 1.353665
C  0.248558 -1.898315 0.511903
C  -1.026955 -3.739855 1.523758
C  1.088658 -0.891312 0.958406
C  0.44948 -2.483643 -0.734186
C  2.122197 -0.446501 0.143441
C  1.491155 -2.03767 -1.530252
C  2.326754 -1.012016 -1.107904
C  4.132274 0.822385 0.175744
C  4.445248 2.099678 -0.261235
C  5.097871 -0.174758 0.221618
C  5.747151 2.384737 -0.650366
C  6.391529 0.120696 -0.181715
C  6.722135 1.39784 -0.616894
H  -4.107882 0.986759 -1.762012
H  -3.970576 -1.16743 -0.686504
H  -2.823044 2.678371 0.400472
H  -5.40896 2.204887 1.61374
H  -5.224071 0.63842 2.393545
H  -3.809805 1.617316 2.035775
H  -6.605162 -0.432063 0.505842
H  -6.095354 -0.20574 -1.168139
H  -6.765819 1.148019 -0.260856
H  -0.591271 3.559139 0.194988
H  0.451614 3.147932 -1.172738
H  0.307086 2.042301 0.18891
H  -0.252068 1.190215 -2.725678
H  -1.831357 0.431738 -2.51146
H  -0.524173 0.098341 -1.376199
H  -0.86525 -1.852643 2.353611
H  0.935481 -0.436528 1.929267
H  -0.200962 -3.273686 -1.0887
H  1.652144 -2.481604 -2.503415
H  3.118882 -0.663668 -1.757635
H  3.679493 2.864706 -0.288778
H  4.849331 -1.168774 0.572049
H  5.994753 3.383075 -0.986058
H  7.146735 -0.65349 -0.147083
H  7.734839 1.622058 -0.923888
elementType: O N C H
totalener: -1285.31836216 hartree
nucrepener: 2752.01065859 hartree
electener: -4037.32902075 hartree
oneelecener: -7218.00672251 hartree
twoeener: 3180.67770176 hartree
cpcmener: -0.04006260 hartree
kineticenergy: 1279.66969572 hartree
xcener: -124.708001460606 hartree
chargesum: -0.0000000
charge: -0.481487 -0.281313 -0.470841 -0.336532 -0.101571 -0.088731 0.092604 -0.086352 0.102317 0.236403 -0.291800 -0.258615 0.374841 -0.271265 -0.224318 0.418152 0.045710 -0.220413 -0.263336 -0.206528 0.297215 -0.141438 -0.186742 0.260850 -0.233582 -0.185896 -0.132618 -0.151628 -0.174332 0.107224 0.095490 0.123249 0.104339 0.102442 0.092948 0.097199 0.090287 0.096865 0.099534 0.104223 0.079884 0.113189 0.109264 0.007834 0.137960 0.136161 0.144675 0.162975 0.157839 0.152102 0.159899 0.161912 0.162267 0.161486
qa: -0.4815 -0.2813 -0.4708 -0.3365 -0.1016 -0.0887 0.0926 -0.0864 0.1023 0.2364 -0.2918 -0.2586 0.3748 -0.2713 -0.2243 0.4182 0.0457 -0.2204 -0.2633 -0.2065 0.2972 -0.1414 -0.1867 0.2608 -0.2336 -0.1859 -0.1326 -0.1516 -0.1743 0.1072 0.0955 0.1232 0.1043 0.1024 0.0929 0.0972 0.0903 0.0969 0.0995 0.1042 0.0799 0.1132 0.1093 0.0078 0.1380 0.1362 0.1447 0.1630 0.1578 0.1521 0.1599 0.1619 0.1623 0.1615
va: 1.9207 2.1310 2.0227 2.0365 3.1118 3.8279 3.8061 3.8813 3.9113 3.7476 3.9021 3.8933 4.0978 3.9531 3.9378 3.7347 3.5649 4.0709 3.9898 3.9334 3.6536 3.9130 3.9044 3.7054 3.9878 3.9271 3.8857 3.8864 3.8911 1.0208 1.0308 0.9962 0.9979 0.9998 1.0177 1.0023 1.0045 1.0017 1.0095 1.0024 1.0084 1.0048 1.0079 1.0357 1.0170 1.0254 1.0097 0.9903 0.9978 1.0033 0.9961 0.9890 0.9891 0.9891
dispcorr: -0.031621243 hartree
energy: -1285.349983402007
dipole: -12.59397 13.07983 0.48585 14.42945 -13.95219 0.47725 -6.99020 6.28214 -0.70805
magnitude: 0.98243 au
magnitude: 2.49713 debye
