program: Orca
programVersion: 5.0.2
elementType: O O O O N C C C C C C C C C C C C C C C C C C C C C C C C H H H H H H H H H H H H H H H H H H H H H H H H H
charge: 0
multiplicity: 1
keywords: wb97x-d3
keywords: def2-TZVPP
keywords: def2/J RIJCOSX
keywords: DEFGRID2
keywords: scfconv7
keywords: smallprint printgap noloewdin
keywords: NOSOSCF
formula: C24H25NO4
InChI: InChI=1/C24H25NO4/c1-23(2)19(21-24(3,4)29-21)20(23)22(26)28-18(14-25)15-9-8-12-17(13-15)27-16-10-6-5-7-11-16/h5-13,18-21H,1-4H3
54 atoms
O  -2.822036 3.213979 -0.905611
O  -1.810925 -1.951208 0.230873
O  -2.59389 -0.24272 1.439385
O  2.901248 -0.334585 -1.000111
N  -0.169284 -4.736074 0.889883
C  -3.665223 0.89631 -1.146415
C  -4.767236 -0.038239 -0.793041
C  -3.336001 -0.556988 -0.819646
C  -3.21603 2.008186 -0.252058
C  -1.826593 2.465271 -0.200556
C  -5.532858 0.089712 0.500059
C  -5.627743 -0.535228 -1.930914
C  -2.582573 -0.859515 0.401985
C  -1.311978 3.104632 1.059813
C  -0.76786 1.826589 -1.056751
C  -0.90717 -2.261336 1.289079
C  0.281389 -1.330638 1.288328
C  -0.497716 -3.645244 1.048141
C  1.112663 -1.279641 0.176172
C  0.505184 -0.496695 2.373977
C  2.161995 -0.373461 0.148804
C  1.560036 0.403528 2.332868
C  2.387244 0.480031 1.223643
C  4.212985 0.078138 -0.958087
C  5.119931 -0.479408 -0.0660
C  4.615026 1.030081 -1.881785
C  6.442599 -0.063595 -0.100333
C  5.945217 1.42662 -1.914251
C  6.86119 0.888477 -1.021481
H  -3.559229 1.119641 -2.203043
H  -3.083153 -1.184769 -1.6652
H  -3.823966 2.180266 0.633787
H  -4.953667 0.472832 1.335192
H  -6.378751 0.763111 0.352787
H  -5.935113 -0.880524 0.795048
H  -5.063571 -0.625489 -2.859592
H  -6.454567 0.154606 -2.108367
H  -6.053132 -1.513132 -1.699833
H  -0.598467 3.89852 0.831949
H  -0.793487 2.363109 1.669339
H  -2.116692 3.529296 1.66023
H  -0.019579 2.565839 -1.348635
H  -1.168255 1.376648 -1.963983
H  -0.250595 1.048045 -0.494933
H  -1.407723 -2.236267 2.261599
H  0.947353 -1.928942 -0.676211
H  -0.142145 -0.542174 3.239728
H  1.734602 1.066602 3.169313
H  3.19175 1.203487 1.203583
H  4.803577 -1.230031 0.647624
H  3.895856 1.452205 -2.572174
H  7.150668 -0.493936 0.595631
H  6.261175 2.166708 -2.637594
H  7.895153 1.205418 -1.044786
elementType: O N C H
totalener: -1285.31825435 hartree
nucrepener: 2735.06655171 hartree
electener: -4020.38480607 hartree
oneelecener: -7184.16861953 hartree
twoeener: 3163.78381346 hartree
cpcmener: -0.04068796 hartree
kineticenergy: 1279.66404010 hartree
xcener: -124.706560724056 hartree
chargesum: -0.0000000
charge: -0.480984 -0.285615 -0.470322 -0.340118 -0.101812 -0.093380 0.086354 -0.076014 0.100993 0.229114 -0.288736 -0.259094 0.372238 -0.267276 -0.233334 0.440928 0.022924 -0.226855 -0.245075 -0.199576 0.270564 -0.151863 -0.166828 0.263242 -0.183290 -0.234748 -0.152171 -0.133987 -0.175566 0.108075 0.094791 0.124031 0.092598 0.103939 0.102932 0.090415 0.097225 0.097557 0.103201 0.086535 0.097334 0.112878 0.104496 0.023359 0.140463 0.133057 0.147760 0.164428 0.159342 0.160106 0.149470 0.163126 0.161122 0.162046
qa: -0.4810 -0.2856 -0.4703 -0.3401 -0.1018 -0.0934 0.0864 -0.0760 0.1010 0.2291 -0.2887 -0.2591 0.3722 -0.2673 -0.2333 0.4409 0.0229 -0.2269 -0.2451 -0.1996 0.2706 -0.1519 -0.1668 0.2632 -0.1833 -0.2347 -0.1522 -0.1340 -0.1756 0.1081 0.0948 0.1240 0.0926 0.1039 0.1029 0.0904 0.0972 0.0976 0.1032 0.0865 0.0973 0.1129 0.1045 0.0234 0.1405 0.1331 0.1478 0.1644 0.1593 0.1601 0.1495 0.1631 0.1611 0.1620
va: 1.9209 2.1321 2.0243 2.0473 3.1118 3.8288 3.8139 3.8710 3.9196 3.7522 3.8999 3.8929 4.0990 3.9442 3.9319 3.7165 3.5774 4.0805 4.0144 3.9157 3.7095 3.8882 3.8753 3.6958 3.9154 4.0023 3.8845 3.8837 3.8892 1.0198 1.0306 0.9969 1.0184 0.9983 0.9996 1.0045 1.0017 1.0022 1.0036 1.0054 1.0086 1.0060 1.0069 1.0404 1.0148 1.0280 1.0070 0.9898 0.9949 0.9955 1.0060 0.9891 0.9886 0.9890
dispcorr: -0.030813544 hartree
energy: -1285.349067896989
dipole: -14.90944 15.19631 0.28687 15.28776 -14.34762 0.94014 -2.83200 3.27266 0.44066
magnitude: 1.07719 au
magnitude: 2.73800 debye
