program: Orca
programVersion: 5.0.2
elementType: O O O O N C C C C C C C C C C C C C C C C C C C C C C C C H H H H H H H H H H H H H H H H H H H H H H H H H
charge: 0
multiplicity: 1
keywords: wb97x-d3
keywords: def2-TZVPP
keywords: def2/J RIJCOSX
keywords: DEFGRID2
keywords: scfconv7
keywords: smallprint printgap noloewdin
keywords: NOSOSCF
formula: C24H25NO4
InChI: InChI=1/C24H25NO4/c1-23(2)19(21-24(3,4)29-21)20(23)22(26)28-18(14-25)15-9-8-12-17(13-15)27-16-10-6-5-7-11-16/h5-13,18-21H,1-4H3
54 atoms
O  -1.315908 2.992306 -0.988829
O  -1.608247 -1.087038 0.071734
O  -3.475842 -1.925698 -0.804278
O  3.114787 -0.078142 1.561551
N  -0.367876 -2.342205 -2.810749
C  -2.916588 1.568441 0.21934
C  -3.276134 0.95241 1.525607
C  -3.578049 0.195228 0.237578
C  -1.509969 1.792488 -0.242232
C  -1.123175 1.741913 -1.655141
C  -2.226119 0.494252 2.508958
C  -4.504635 1.496186 2.218573
C  -2.914065 -1.033154 -0.213492
C  0.307271 1.455122 -2.020636
C  -2.131209 1.396273 -2.716947
C  -0.900025 -2.272708 -0.248132
C  0.369851 -2.288248 0.565426
C  -0.611807 -2.297753 -1.687276
C  1.176765 -1.157176 0.615978
C  0.698459 -3.427031 1.285233
C  2.315776 -1.176688 1.406748
C  1.846601 -3.432101 2.065746
C  2.65835 -2.312825 2.130796
C  3.31508 0.773748 0.499788
C  3.699468 0.297413 -0.747023
C  3.184435 2.133735 0.734943
C  3.957449 1.203527 -1.765234
C  3.456158 3.029582 -0.290828
C  3.839526 2.569769 -1.54263
H  -3.597022 2.33793 -0.131271
H  -4.620785 0.193782 -0.056246
H  -0.72719 1.605856 0.491677
H  -1.271348 0.220472 2.070376
H  -2.032982 1.300016 3.219184
H  -2.587068 -0.362871 3.079273
H  -4.951232 0.740918 2.867529
H  -5.265417 1.819978 1.507889
H  -4.240548 2.354409 2.838991
H  0.603499 2.037603 -2.89546
H  0.439472 0.402257 -2.269342
H  0.986153 1.700024 -1.203654
H  -3.148778 1.667153 -2.439485
H  -2.110628 0.32377 -2.916443
H  -1.889766 1.905439 -3.651877
H  -1.492061 -3.163285 -0.019446
H  0.912263 -0.266912 0.059238
H  0.060518 -4.30033 1.244758
H  2.108759 -4.31532 2.632137
H  3.549291 -2.31257 2.745327
H  3.805675 -0.765725 -0.923958
H  2.882544 2.487769 1.712456
H  4.259801 0.835897 -2.736961
H  3.359343 4.091615 -0.107555
H  4.045243 3.270358 -2.34068
elementType: O N C H
totalener: -1285.31711111 hartree
nucrepener: 2860.10311245 hartree
electener: -4145.42022356 hartree
oneelecener: -7433.58474739 hartree
twoeener: 3288.16452383 hartree
cpcmener: -0.04376112 hartree
kineticenergy: 1279.67214310 hartree
xcener: -124.709922882622 hartree
chargesum: -0.0000000
charge: -0.484803 -0.259900 -0.474362 -0.340163 -0.098705 -0.113671 0.105176 -0.124686 0.150381 0.223606 -0.271184 -0.264155 0.418055 -0.246547 -0.278583 0.380599 0.009952 -0.221894 -0.182539 -0.180170 0.241325 -0.121084 -0.230581 0.293314 -0.186369 -0.248225 -0.138044 -0.105296 -0.201681 0.104479 0.094347 0.127148 0.075212 0.101951 0.107619 0.098361 0.090038 0.095960 0.117800 0.091045 0.030703 0.102439 0.089750 0.109613 0.133750 0.132431 0.148624 0.162585 0.150263 0.156990 0.147195 0.160826 0.161009 0.160096
qa: -0.4848 -0.2599 -0.4744 -0.3402 -0.0987 -0.1137 0.1052 -0.1247 0.1504 0.2236 -0.2712 -0.2642 0.4181 -0.2465 -0.2786 0.3806 0.0100 -0.2219 -0.1825 -0.1802 0.2413 -0.1211 -0.2306 0.2933 -0.1864 -0.2482 -0.1380 -0.1053 -0.2017 0.1045 0.0943 0.1271 0.0752 0.1020 0.1076 0.0984 0.0900 0.0960 0.1178 0.0910 0.0307 0.1024 0.0897 0.1096 0.1337 0.1324 0.1486 0.1626 0.1503 0.1570 0.1472 0.1608 0.1610 0.1601
va: 1.9093 2.1553 2.0286 2.0708 3.0871 3.8443 3.7979 3.9041 3.8343 3.7576 3.9148 3.9033 4.0978 3.9592 3.9655 3.7803 3.6885 4.0015 3.9047 3.9247 3.7630 3.9020 3.9907 3.6444 3.8894 3.9715 3.8389 3.8324 3.8790 1.0232 1.0285 0.9870 1.0059 1.0011 1.0000 1.0009 1.0053 1.0021 1.0090 1.0086 1.0253 1.0017 1.0087 1.0026 1.0258 0.9908 0.9990 0.9879 1.0050 0.9978 1.0073 0.9903 0.9879 0.9907
dispcorr: -0.034596852 hartree
energy: -1285.351707958372
dipole: -9.87316 10.15769 0.28454 12.94129 -13.08703 -0.14574 2.85582 -0.67521 2.18061
magnitude: 2.20392 au
magnitude: 5.60191 debye
