program: Orca
programVersion: 5.0.2
elementType: O O O O N C C C C C C C C C C C C C C C C C C C C C C C C H H H H H H H H H H H H H H H H H H H H H H H H H
charge: 0
multiplicity: 1
keywords: wb97x-d3
keywords: def2-TZVPP
keywords: def2/J RIJCOSX
keywords: DEFGRID2
keywords: scfconv7
keywords: smallprint printgap noloewdin
keywords: NOSOSCF
formula: C24H25NO4
InChI: InChI=1/C24H25NO4/c1-23(2)19(21-24(3,4)29-21)20(23)22(26)28-18(14-25)15-9-8-12-17(13-15)27-16-10-6-5-7-11-16/h5-13,18-21H,1-4H3
54 atoms
O  -1.719732 3.512325 1.911869
O  -1.341027 -1.34527 -0.813039
O  -1.953148 -0.591118 1.201496
O  3.602625 -0.643787 0.102406
N  -1.108816 -4.343032 -2.155038
C  -2.401596 2.132378 -0.024823
C  -3.547431 1.432442 -0.668105
C  -2.152108 0.816511 -0.735947
C  -2.258454 2.270325 1.45791
C  -0.957755 2.318095 2.123057
C  -4.632764 0.78607 0.155383
C  -4.053278 1.991901 -1.975564
C  -1.826873 -0.398698 0.018189
C  -0.849258 1.876182 3.556296
C  0.315605 2.205658 1.33068
C  -0.941359 -2.57373 -0.238015
C  0.476992 -2.556024 0.29697
C  -1.034875 -3.552768 -1.322901
C  1.356442 -1.545349 -0.065971
C  0.88821 -3.603214 1.109355
C  2.668839 -1.596598 0.389361
C  2.202364 -3.640299 1.551537
C  3.097565 -2.646639 1.193332
C  3.307492 0.359949 -0.796102
C  3.248686 1.660293 -0.32374
C  3.119967 0.075964 -2.142152
C  2.984769 2.693903 -1.212917
C  2.8466 1.11579 -3.018592
C  2.773916 2.424625 -2.557738
H  -2.008431 2.980821 -0.575824
H  -1.667671 0.877978 -1.703151
H  -3.102931 1.924696 2.051347
H  -5.11585 -0.006555 -0.417926
H  -4.291279 0.352131 1.091836
H  -5.396141 1.526875 0.398779
H  -4.807961 2.759112 -1.792909
H  -4.51285 1.21011 -2.58232
H  -3.252964 2.44474 -2.561401
H  -0.121725 2.484321 4.097139
H  -0.512111 0.840227 3.605479
H  -1.805151 1.943046 4.076245
H  0.210677 2.560628 0.306558
H  0.642074 1.165275 1.293436
H  1.112916 2.779788 1.80633
H  -1.632871 -2.893724 0.548543
H  1.025079 -0.732326 -0.697076
H  0.193137 -4.38486 1.389247
H  2.535689 -4.454016 2.18156
H  4.123219 -2.678259 1.537845
H  3.404972 1.862569 0.728061
H  3.177997 -0.94414 -2.500784
H  2.934489 3.710689 -0.846523
H  2.690555 0.899622 -4.067221
H  2.55865 3.230905 -3.246021
elementType: O N C H
totalener: -1285.31726424 hartree
nucrepener: 2806.87190483 hartree
electener: -4092.18916907 hartree
oneelecener: -7327.41790092 hartree
twoeener: 3235.22873186 hartree
cpcmener: -0.04167778 hartree
kineticenergy: 1279.66597899 hartree
xcener: -124.707668743284 hartree
chargesum: 0.0000000
charge: -0.483528 -0.296164 -0.468623 -0.333940 -0.100489 -0.075200 0.090956 -0.086717 0.099637 0.237400 -0.289608 -0.260162 0.385347 -0.260537 -0.303135 0.408963 0.027980 -0.221487 -0.255735 -0.250319 0.342732 -0.099533 -0.258086 0.296753 -0.247751 -0.200310 -0.145410 -0.141361 -0.162721 0.107685 0.097097 0.125859 0.103548 0.090492 0.108216 0.097720 0.097158 0.090995 0.101653 0.089902 0.094117 0.100551 0.084567 0.117892 0.144891 0.138847 0.149211 0.161958 0.148551 0.154617 0.157655 0.162334 0.163006 0.162527
qa: -0.4835 -0.2962 -0.4686 -0.3339 -0.1005 -0.0752 0.0910 -0.0867 0.0996 0.2374 -0.2896 -0.2602 0.3853 -0.2605 -0.3031 0.4090 0.0280 -0.2215 -0.2557 -0.2503 0.3427 -0.0995 -0.2581 0.2968 -0.2478 -0.2003 -0.1454 -0.1414 -0.1627 0.1077 0.0971 0.1259 0.1035 0.0905 0.1082 0.0977 0.0972 0.0910 0.1017 0.0899 0.0941 0.1006 0.0846 0.1179 0.1449 0.1388 0.1492 0.1620 0.1486 0.1546 0.1577 0.1623 0.1630 0.1625
va: 1.9152 2.1113 2.0235 2.0790 3.1147 3.8032 3.8469 3.8533 3.9344 3.7530 3.9075 3.8912 4.0649 3.9456 3.9879 3.7113 3.6865 4.0597 3.9249 4.0045 3.6791 3.8811 4.0033 3.6371 3.9873 3.9374 3.8328 3.8717 3.8852 1.0202 1.0287 0.9947 1.0008 1.0161 0.9975 1.0013 1.0023 1.0047 1.0033 1.0065 1.0062 0.9981 0.9934 1.0007 1.0230 1.0211 1.0006 0.9873 1.0073 1.0008 0.9971 0.9893 0.9883 0.9884
dispcorr: -0.031300220 hartree
energy: -1285.348564459551
dipole: -13.03143 12.94302 -0.08842 18.34981 -17.68448 0.66533 4.51597 -4.59075 -0.07478
magnitude: 0.67534 au
magnitude: 1.71657 debye
