program: Orca
programVersion: 5.0.2
elementType: O O O O N C C C C C C C C C C C C C C C C C C C C C C C C H H H H H H H H H H H H H H H H H H H H H H H H H
charge: 0
multiplicity: 1
keywords: wb97x-d3
keywords: def2-TZVPP
keywords: def2/J RIJCOSX
keywords: DEFGRID2
keywords: scfconv7
keywords: smallprint printgap noloewdin
keywords: NOSOSCF
formula: C24H25NO4
InChI: InChI=1/C24H25NO4/c1-23(2)19(21-24(3,4)29-21)20(23)22(26)28-18(14-25)15-9-8-12-17(13-15)27-16-10-6-5-7-11-16/h5-13,18-21H,1-4H3
54 atoms
O  -2.633615 3.557169 0.050788
O  -1.257649 -1.620914 -0.480839
O  -2.455312 -0.521046 1.048936
O  3.254018 0.690006 0.790526
N  0.617334 -4.326271 -0.594951
C  -3.149358 1.450885 -1.150448
C  -4.175627 0.399614 -1.381863
C  -2.709326 -0.002776 -1.280593
C  -2.992245 2.179424 0.146053
C  -1.688931 2.644809 0.621327
C  -5.172751 0.014122 -0.318012
C  -4.746379 0.299429 -2.776992
C  -2.170352 -0.702276 -0.109637
C  -1.45664 2.793635 2.099419
C  -0.442317 2.408527 -0.18697
C  -0.620305 -2.34081 0.569613
C  0.363168 -1.496274 1.345965
C  0.067071 -3.447289 -0.097898
C  1.379749 -0.833186 0.667145
C  0.226938 -1.370236 2.720013
C  2.263652 -0.039412 1.384291
C  1.118842 -0.571477 3.422025
C  2.138118 0.09359 2.762218
C  3.819913 0.258173 -0.386649
C  3.910158 1.169364 -1.426949
C  4.345955 -1.021589 -0.507609
C  4.547975 0.796286 -2.602888
C  4.968064 -1.385107 -1.692897
C  5.07409 -0.480366 -2.741954
H  -2.882584 2.045735 -2.017958
H  -2.233798 -0.270983 -2.216003
H  -3.752863 1.984856 0.899374
H  -6.061797 0.6392 -0.416053
H  -5.48566 -1.022328 -0.453461
H  -4.813229 0.118205 0.701528
H  -4.01755 0.581833 -3.537157
H  -5.609864 0.958517 -2.881602
H  -5.076511 -0.718747 -2.989485
H  -0.965396 1.900668 2.490119
H  -2.388477 2.93216 2.647963
H  -0.805633 3.644315 2.308913
H  0.269909 3.221659 -0.033637
H  -0.636391 2.327927 -1.255403
H  0.043927 1.487569 0.136713
H  -1.357867 -2.780346 1.248871
H  1.469329 -0.926594 -0.409089
H  -0.570145 -1.886925 3.238218
H  1.020759 -0.466174 4.494025
H  2.833599 0.717858 3.308419
H  3.495402 2.163017 -1.313684
H  4.279281 -1.726128 0.312104
H  4.62723 1.508504 -3.413605
H  5.379489 -2.381009 -1.791218
H  5.567057 -0.769028 -3.660573
elementType: O N C H
totalener: -1285.31810666 hartree
nucrepener: 2781.90058781 hartree
electener: -4067.21869447 hartree
oneelecener: -7277.94717844 hartree
twoeener: 3210.72848397 hartree
cpcmener: -0.04126379 hartree
kineticenergy: 1279.66438744 hartree
xcener: -124.706045049741 hartree
chargesum: -0.0000000
charge: -0.479720 -0.287484 -0.467385 -0.338266 -0.101173 -0.099328 0.082939 -0.066385 0.112623 0.223769 -0.287436 -0.259049 0.364101 -0.251949 -0.267275 0.445939 0.008428 -0.225607 -0.191690 -0.197160 0.241009 -0.126915 -0.230168 0.276100 -0.239647 -0.188021 -0.132119 -0.147975 -0.177872 0.108424 0.094337 0.123415 0.103473 0.103895 0.092323 0.090443 0.096895 0.097685 0.076466 0.095485 0.102698 0.113068 0.105024 0.056687 0.142335 0.150376 0.147014 0.161225 0.150060 0.150158 0.159035 0.161740 0.163063 0.162396
qa: -0.4797 -0.2875 -0.4674 -0.3383 -0.1012 -0.0993 0.0829 -0.0664 0.1126 0.2238 -0.2874 -0.2590 0.3641 -0.2519 -0.2673 0.4459 0.0084 -0.2256 -0.1917 -0.1972 0.2410 -0.1269 -0.2302 0.2761 -0.2396 -0.1880 -0.1321 -0.1480 -0.1779 0.1084 0.0943 0.1234 0.1035 0.1039 0.0923 0.0904 0.0969 0.0977 0.0765 0.0955 0.1027 0.1131 0.1050 0.0567 0.1423 0.1504 0.1470 0.1612 0.1501 0.1502 0.1590 0.1617 0.1631 0.1624
va: 1.9225 2.1310 2.0268 2.0499 3.1113 3.8254 3.8174 3.8572 3.9096 3.7714 3.8986 3.8932 4.1052 3.9459 3.9444 3.7166 3.5970 4.0880 3.8642 3.9301 3.7034 3.8952 3.9841 3.6852 3.9990 3.9211 3.8824 3.8854 3.8942 1.0193 1.0304 0.9975 0.9987 0.9991 1.0192 1.0045 1.0021 1.0019 1.0056 1.0085 1.0043 1.0048 1.0055 1.0229 1.0153 1.0161 1.0047 0.9887 1.0049 1.0059 0.9970 0.9884 0.9890 0.9889
dispcorr: -0.031195781 hartree
energy: -1285.349302440401
dipole: -16.63381 16.22606 -0.40775 12.69290 -12.66259 0.03031 -4.20963 4.15308 -0.05655
magnitude: 0.41277 au
magnitude: 1.04917 debye
