program: Orca
programVersion: 5.0.2
elementType: O O C C C C C C C C C C C C C C C C C C H H H H H H H H H H H H H H H H H H H H H H H H H H
charge: 0
multiplicity: 1
keywords: wb97x-d3
keywords: def2-TZVPP
keywords: def2/J RIJCOSX
keywords: DEFGRID2
keywords: scfconv7
keywords: smallprint printgap noloewdin
keywords: NOSOSCF
formula: C18H26O2
InChI: InChI=1/C18H26O2/c1-8-10-13(5)15(9-2)20-17(19)16-14(11-12(3)4)18(16,6)7/h2,10-11,14-16H,8H2,1,3-7H3
46 atoms
O  -1.064525 -1.178503 -0.58087
O  -0.389326 -0.315658 1.375053
C  1.888381 0.80863 -0.481481
C  2.402279 -0.312103 0.371065
C  1.152908 -0.522478 -0.440931
C  1.30562 2.029491 0.186693
C  2.605037 1.118789 -1.772606
C  3.637714 -1.064965 0.031287
C  -0.152099 -0.64608 0.243809
C  4.87164 -0.685064 0.365099
C  5.16405 0.575541 1.120737
C  6.069861 -1.512082 0.009966
C  -2.416711 -1.23682 -0.106963
C  -3.114307 0.075291 -0.385309
C  -3.052467 -2.359157 -0.789273
C  -3.240989 0.447183 -1.830427
C  -3.525039 0.802952 0.652606
C  -4.229885 2.120166 0.636348
C  -3.612972 -3.270343 -1.330796
C  -5.624442 2.023117 1.252388
H  2.211413 -0.187499 1.433945
H  1.246275 -1.120494 -1.341357
H  0.849895 1.810119 1.148896
H  2.093748 2.767278 0.351246
H  0.547514 2.497146 -0.4447
H  2.988512 0.225007 -2.262621
H  1.937234 1.626279 -2.470884
H  3.456492 1.776856 -1.587718
H  3.513058 -1.996063 -0.51422
H  5.634112 0.351829 2.081816
H  5.870474 1.201854 0.570277
H  4.273052 1.169501 1.314767
H  5.799194 -2.409476 -0.544975
H  6.775999 -0.940301 -0.597214
H  6.612165 -1.823814 0.906223
H  -2.423581 -1.433428 0.969003
H  -2.259331 0.546544 -2.296918
H  -3.778316 -0.323457 -2.386043
H  -3.76969 1.386211 -1.973405
H  -3.342273 0.403666 1.646967
H  -4.301765 2.524367 -0.373761
H  -3.635733 2.838536 1.209186
H  -4.098413 -4.087838 -1.806857
H  -6.256131 1.341556 0.683217
H  -5.580339 1.652772 2.277206
H  -6.113388 2.996879 1.274301
totalener: -851.99520741 hartree
nucrepener: 1537.07145306 hartree
electener: -2389.06666047 hartree
oneelecener: -4207.06387011 hartree
twoeener: 1817.99720965 hartree
kineticenergy: 848.02066835 hartree
xcener: -85.218355140988 hartree
chargesum: 0.0000000
charge: -0.267303 -0.387187 0.086655 -0.031818 -0.110678 -0.268894 -0.243524 -0.190014 0.347267 -0.027310 -0.235148 -0.211816 0.115653 -0.152682 -0.455370 -0.247764 -0.018079 -0.100972 0.208780 -0.244190 0.107240 0.082111 0.105068 0.083121 0.087722 0.082401 0.093480 0.086048 0.090548 0.096746 0.084529 0.080878 0.079495 0.083186 0.086670 0.109936 0.095963 0.100540 0.084613 0.091481 0.059363 0.073722 0.244125 0.083904 0.078303 0.083200
qa: -0.2673 -0.3872 0.0867 -0.0318 -0.1107 -0.2689 -0.2435 -0.1900 0.3473 -0.0273 -0.2351 -0.2118 0.1157 -0.1527 -0.4554 -0.2478 -0.0181 -0.1010 0.2088 -0.2442 0.1072 0.0821 0.1051 0.0831 0.0877 0.0824 0.0935 0.0860 0.0905 0.0967 0.0845 0.0809 0.0795 0.0832 0.0867 0.1099 0.0960 0.1005 0.0846 0.0915 0.0594 0.0737 0.2441 0.0839 0.0783 0.0832
va: 2.1255 2.1200 3.7215 3.8260 3.8771 3.9045 3.9049 3.8540 4.2594 3.7399 3.9370 3.9401 3.9240 3.8318 4.0137 3.9520 3.8037 3.9291 3.4657 3.9151 1.0264 1.0359 1.0204 1.0023 1.0034 1.0078 1.0058 1.0029 1.0131 1.0021 1.0003 1.0115 1.0105 0.9991 0.9978 1.0229 1.0055 1.0028 1.0105 1.0202 1.0158 1.0045 0.9723 1.0049 1.0057 1.0071
dispcorr: -0.020698444 hartree
energy: -852.015905852713
dipole: 8.91120 -8.68389 0.22731 14.67960 -14.30095 0.37865 -1.01425 0.49985 -0.51440
magnitude: 0.67798 au
magnitude: 1.72328 debye
