program: Gaussian 09
title: 000007245
version: EM64L-G09RevD.01
frameworkgroup: C1[X(C6H5ClO)]
method: RPBEPBE
basis: SDD
operation: Freq
keyword: #p
keyword: freq=noraman
keyword: PBEPBE/SDD
title: #p freq=noraman PBEPBE/SDD
converged: NO NO NO NO
title: Mulliken charges:
elementType: Cl O C C C C C C H H H H H
charge: -0.067074 -0.416193 0.377665 -0.270117 -0.314397 -0.214360 -0.194932 -0.239427 0.257495 0.253867 0.234096 0.235209 0.358169
chargesum: 0.00000
title: Mulliken charges with hydrogens summed into heavy atoms:
elementType: Cl O C C C C C C
charge: -0.067074 -0.058024 0.377665 -0.270117 -0.056902 0.039507 0.039164 -0.004219
polarizability: 1.04079700e+02 2.25523523e+00 8.29105339e+01 -4.40771287e-03 1.93554442e-03 2.94367909e+01
1716.lowfreq: -7.9335 -4.4158 -0.0038 -0.0036 -0.0032 14.3178 152.0339 235.5255 252.0847
frequency: 152.0323 235.5243 252.0835 353.0856 433.7918 458.8995 463.6159 530.7870 538.2716 655.1277 694.5579 753.0285 807.2441 845.0601 930.8375 974.3721 1005.7300 1028.3156 1114.7815 1165.5275 1172.5177 1235.9633 1309.8048 1391.6685 1443.5784 1462.4259 1588.6199 1605.5991 3142.1699 3156.0847 3170.4376 3180.4032 3497.3822
redmass: 5.1824 8.7093 5.3362 9.3464 3.0878 1.1057 4.9506 3.9147 8.0030 6.9073 3.8579 1.2421 6.2156 1.3790 1.3572 1.3112 6.4412 2.0315 1.5889 1.0729 1.3922 2.0289 1.5611 5.8084 2.3359 2.8946 6.1441 7.2560 1.0860 1.0905 1.0951 1.1003 1.0648
irintensity: 0.0067 3.9140 2.4468 3.0975 22.4398 138.8327 17.4397 1.2673 5.1970 25.4809 0.4241 100.7704 15.1605 1.9664 2.5960 0.1205 50.2184 9.8544 1.5742 12.3024 188.0214 23.2929 12.2950 16.2731 14.1014 96.0191 6.6064 28.5660 2.8957 8.0288 9.0736 8.2007 52.0615
temp: 298.150 k
press: 1.00000 atm
elementType: 17 8 6 6 6 6 6 6 1 1 1 1 1
symmnumber: 1
zpe: 243735.1 jmol-1
zpe.correction: 0.092834 hartree
zpe.thermalcorrener: 0.099594 hartree
zpe.thermalcorrenthalpy: 0.100539 hartree
zpe.thermalcorrgfe: 0.061548 hartree
zpe.sumelectzpe: -766.341400 hartree
zpe.sumelectthermal: -766.334639 hartree
zpe.sumelectthermalent: -766.333695 hartree
zpe.sumelectthermalfe: -766.372685 hartree
dipole: -0.8713 -0.9393 0.0000
dipole: 1.2812
quadrupole: -46.5250 -51.9096 -56.9206
quadrupole: 2.2706 -0.0005 0.0000
quadrupole: 5.2601 -0.1245 -5.1355 2.2706 -0.0005 0.0000
hfenergy: -766.4342335 hartree
pointgroup: C01 [X(C6H5Cl1O1)]
dipole: -0.42145 -0.2765074 0.0000176 debye
dipolederiv: -0.6899422 0.1954775 0.0000447 0.1912236 -0.2501696 -0.0000213 0.0000411 -0.0000215 -0.0584973 -0.8954097 -0.5727731 -0.0000113 -0.5744935 -0.5769605 0.0000127 -0.0000108 0.0000122 -0.4049949 0.600874 0.7036626 0.0000257 0.6056789 0.4280602 -0.000005 0.0000193 -0.0000056 0.1042992 0.8346926 -0.3149596 -0.0000717 -0.5767974 0.0461941 0.0000355 -0.0000824 0.0000214 -0.1121852 -0.1669898 -0.2697855 -0.0000175 0.0905643 0.0278024 0.0000055 0.0000015 0.0000195 -0.1719383 -0.0770328 -0.0332029 0.0000005 0.1251319 -0.0047244 -0.0000043 0.0000078 0.0000022 -0.0744994 0.1096841 0.0374758 -0.0000092 -0.0841164 0.1370899 0.0000179 -0.0000145 0.0000129 -0.1441899 -0.0646277 0.1086013 -0.0000032 0.0475999 -0.0933474 0.0000012 -0.0000053 -0.0000003 -0.1996018 0.0786879 0.0145302 0.0000053 0.0183968 -0.0471347 -0.0000119 0.0000044 -0.0000131 0.1776944 0.0981838 0.0367702 0.0000055 0.0230825 -0.0387092 -0.0000101 0.0000053 -0.0000098 0.1677563 -0.0828856 0.0705137 0.0000154 0.0733308 0.0646019 -0.0000078 0.0000154 -0.0000077 0.1632812 -0.0439162 -0.0839052 0.0000074 -0.0842779 0.0093579 -0.0000033 0.0000071 -0.0000032 0.1747358 0.2986814 0.1075949 0.0000084 0.1446765 0.2979392 -0.000009 0.000011 -0.0000071 0.37814 unknown
polarizability: 103.9114063|-2.9360504|83.0788272|-0.0038144|0.0029367|29.4367909 unknown
InChI: InChI=1S/C6H5ClO/c7-5-3-1-2-4-6(5)8/h1-4,8H
charge 0 multiplicity 1
13 atoms
Cl 2.364243 -1.241568 -0.000206
O  1.524598 1.711038 0.00002
C  0.464584 0.802523 0.000009
C  0.64247 -0.603661 -0.000079
C  -0.853738 1.316684 0.00009
C  -0.445148 -1.492395 -0.000065
C  -1.954516 0.435834 0.000102
C  -1.757773 -0.966529 0.000028
H  -0.980325 2.403201 0.000148
H  -0.268383 -2.572234 -0.00012
H  -2.969695 0.846409 0.000171
H  -2.612619 -1.649667 0.000041
H  2.391504 1.223167 -0.000039
