program: Orca
programVersion: 5.0.2
elementType: O O C C C C C C C C C C C C C C C C C C H H H H H H H H H H H H H H H H H H H H H H H H H H
charge: 0
multiplicity: 1
keywords: wb97x-d3
keywords: def2-TZVPP
keywords: def2/J RIJCOSX
keywords: DEFGRID2
keywords: scfconv7
keywords: smallprint printgap noloewdin
keywords: NOSOSCF
formula: C18H26O2
InChI: InChI=1/C18H26O2/c1-8-10-13(5)15(9-2)20-17(19)16-14(11-12(3)4)18(16,6)7/h2,10-11,14-16H,8H2,1,3-7H3
46 atoms
O  -0.922739 -0.272983 -0.188461
O  0.146366 -0.269496 1.783914
C  2.19678 1.445634 0.10148
C  2.72556 0.058898 0.310825
C  1.32398 0.247355 -0.23614
C  1.896095 2.287941 1.316664
C  2.673722 2.263436 -1.074611
C  3.749619 -0.550956 -0.559223
C  0.157728 -0.121673 0.586025
C  4.808852 -1.264712 -0.163379
C  5.156682 -1.564041 1.262979
C  5.757183 -1.847557 -1.168325
C  -2.186784 -0.622258 0.406815
C  -3.166553 0.480855 0.073788
C  -2.540166 -1.951969 -0.07505
C  -2.763353 1.809504 0.641669
C  -4.265787 0.247189 -0.642719
C  -5.332244 1.223446 -1.021176
C  -2.819177 -3.055895 -0.454719
C  -6.681036 0.850576 -0.411437
H  2.750981 -0.245061 1.35147
H  1.19606 0.067661 -1.298099
H  2.760909 2.912011 1.550927
H  1.051496 2.955879 1.132429
H  1.672821 1.700394 2.204347
H  1.955956 3.053562 -1.303886
H  3.628551 2.741425 -0.845825
H  2.807753 1.673003 -1.980121
H  3.609997 -0.411878 -1.627459
H  5.091003 -2.637774 1.458942
H  6.190468 -1.277521 1.472012
H  4.524441 -1.057569 1.989273
H  5.45521 -1.635953 -2.194205
H  6.76893 -1.457273 -1.027848
H  5.828214 -2.933034 -1.056723
H  -2.075109 -0.670504 1.494757
H  -1.938102 2.255439 0.081405
H  -3.580293 2.527874 0.638462
H  -2.424371 1.70606 1.675127
H  -4.444203 -0.766107 -0.992662
H  -5.426094 1.223638 -2.1116
H  -5.068797 2.243175 -0.73875
H  -3.067467 -4.035714 -0.797463
H  -6.983686 -0.158067 -0.698181
H  -6.645776 0.887931 0.678228
H  -7.462474 1.535498 -0.743317
elementType: O C H
totalener: -852.01191800 hartree
nucrepener: 1516.15511713 hartree
electener: -2368.16703513 hartree
oneelecener: -4165.73470323 hartree
twoeener: 1797.56766810 hartree
cpcmener: -0.02099735 hartree
kineticenergy: 847.96590562 hartree
xcener: -85.213756160034 hartree
chargesum: -0.0000000
charge: -0.281249 -0.462754 0.104136 0.038436 -0.104496 -0.272658 -0.270264 -0.274195 0.397966 -0.048384 -0.254417 -0.218185 0.104222 -0.134498 -0.527596 -0.275448 -0.064056 -0.083120 0.214160 -0.258806 0.091872 0.088705 0.096963 0.094675 0.093341 0.097061 0.098024 0.088206 0.116207 0.097864 0.093517 0.090729 0.087656 0.093482 0.092199 0.133203 0.103012 0.106699 0.105122 0.122258 0.075078 0.065337 0.281230 0.084248 0.084090 0.090428
qa: -0.2812 -0.4628 0.1041 0.0384 -0.1045 -0.2727 -0.2703 -0.2742 0.3980 -0.0484 -0.2544 -0.2182 0.1042 -0.1345 -0.5276 -0.2754 -0.0641 -0.0831 0.2142 -0.2588 0.0919 0.0887 0.0970 0.0947 0.0933 0.0971 0.0980 0.0882 0.1162 0.0979 0.0935 0.0907 0.0877 0.0935 0.0922 0.1332 0.1030 0.1067 0.1051 0.1223 0.0751 0.0653 0.2812 0.0842 0.0841 0.0904
va: 2.0949 2.0518 3.6897 3.7865 3.8311 3.9038 3.9099 3.8821 4.1926 3.7639 3.9420 3.9214 3.8741 3.7682 4.0941 3.9455 3.7486 3.9276 3.4173 3.9081 1.0330 1.0377 1.0009 1.0011 1.0187 1.0017 1.0017 1.0064 1.0119 0.9963 0.9976 1.0098 1.0092 0.9964 0.9959 1.0199 1.0001 1.0046 1.0029 1.0115 1.0037 1.0128 0.9494 1.0034 1.0037 1.0050
dispcorr: -0.019439607 hartree
energy: -852.031357608916
dipole: 5.59570 -5.58324 0.01246 9.48494 -8.94963 0.53532 -2.49819 1.67511 -0.82308
magnitude: 0.98193 au
magnitude: 2.49586 debye
