program: Orca
programVersion: 5.0.2
elementType: O O C C C C C C C C C C C C C C C C C C H H H H H H H H H H H H H H H H H H H H H H H H H H
charge: 0
multiplicity: 1
keywords: wb97x-d3
keywords: def2-TZVPP
keywords: def2/J RIJCOSX
keywords: DEFGRID2
keywords: scfconv7
keywords: smallprint printgap noloewdin
keywords: NOSOSCF
formula: C18H26O2
InChI: InChI=1/C18H26O2/c1-8-10-13(5)15(9-2)20-17(19)16-14(11-12(3)4)18(16,6)7/h2,10-11,14-16H,8H2,1,3-7H3
46 atoms
O  -0.835158 0.101777 0.019519
O  0.18474 0.04826 2.006404
C  2.382449 1.750166 0.523779
C  2.787617 0.31953 0.54596
C  1.399025 0.694093 0.042463
C  2.162201 2.471678 1.830484
C  2.924569 2.648058 -0.562818
C  3.779243 -0.271399 -0.385007
C  0.226372 0.261467 0.818061
C  3.793735 -1.56675 -0.711841
C  2.764629 -2.528634 -0.187963
C  4.850911 -2.14386 -1.600222
C  -2.04187 -0.419488 0.597583
C  -3.140673 -0.213621 -0.41716
C  -1.86036 -1.83501 0.921437
C  -2.995398 -0.953317 -1.711157
C  -4.150634 0.593267 -0.08768
C  -5.332778 0.96302 -0.922778
C  -1.738808 -3.002182 1.176336
C  -5.262941 2.420503 -1.372441
H  2.765467 -0.136012 1.533895
H  1.260764 0.660593 -1.03214
H  3.08708 2.968002 2.131898
H  1.395585 3.242872 1.731233
H  1.870712 1.809958 2.642963
H  3.90947 3.033113 -0.289863
H  3.020862 2.138244 -1.521677
H  2.266718 3.506209 -0.7125
H  4.550452 0.381862 -0.783141
H  1.754519 -2.115898 -0.223461
H  2.760896 -3.459582 -0.755677
H  2.960219 -2.793065 0.854941
H  4.410142 -2.596963 -2.49219
H  5.573789 -1.394544 -1.923113
H  5.397582 -2.941597 -1.089525
H  -2.281228 0.126691 1.514208
H  -3.725651 -0.637354 -2.452858
H  -2.005742 -0.803483 -2.146576
H  -3.116661 -2.029839 -1.568051
H  -4.118148 1.069619 0.889575
H  -6.238742 0.817959 -0.327311
H  -5.430531 0.313182 -1.792938
H  -1.625941 -4.038537 1.405251
H  -6.156385 2.699949 -1.93236
H  -5.181929 3.098014 -0.520731
H  -4.398186 2.592207 -2.014929
elementType: O C H
totalener: -852.01071739 hartree
nucrepener: 1543.88993976 hartree
electener: -2395.90065715 hartree
oneelecener: -4221.42824125 hartree
twoeener: 1825.52758410 hartree
cpcmener: -0.02155800 hartree
kineticenergy: 847.97337355 hartree
xcener: -85.212614835481 hartree
chargesum: 0.0000000
charge: -0.286382 -0.465616 0.154022 -0.024797 -0.107608 -0.277443 -0.290094 -0.289147 0.384238 0.002227 -0.276116 -0.225333 0.209027 -0.137773 -0.496386 -0.264647 -0.086542 -0.087545 0.115368 -0.261750 0.101737 0.095177 0.094408 0.098900 0.093919 0.099909 0.091238 0.098122 0.123258 0.093135 0.098927 0.106392 0.094487 0.085654 0.099352 0.116600 0.100849 0.104568 0.104401 0.121071 0.075550 0.068376 0.283498 0.091570 0.085709 0.085490
qa: -0.2864 -0.4656 0.1540 -0.0248 -0.1076 -0.2774 -0.2901 -0.2891 0.3842 0.0022 -0.2761 -0.2253 0.2090 -0.1378 -0.4964 -0.2646 -0.0865 -0.0875 0.1154 -0.2618 0.1017 0.0952 0.0944 0.0989 0.0939 0.0999 0.0912 0.0981 0.1233 0.0931 0.0989 0.1064 0.0945 0.0857 0.0994 0.1166 0.1008 0.1046 0.1044 0.1211 0.0755 0.0684 0.2835 0.0916 0.0857 0.0855
va: 2.1238 2.0396 3.7147 3.8182 3.8473 3.8834 3.9134 3.8585 4.1486 3.6800 3.9610 3.9273 3.8352 3.8142 3.7778 3.9427 3.8129 3.9241 3.6025 3.9086 1.0245 1.0280 1.0009 0.9994 1.0188 0.9992 1.0019 1.0030 1.0034 0.9952 1.0055 0.9956 0.9948 1.0081 0.9931 1.0278 1.0066 1.0073 0.9957 1.0087 1.0049 1.0109 0.9489 1.0049 1.0028 1.0026
dispcorr: -0.020251270 hartree
energy: -852.030968659243
dipole: 2.62667 -2.79656 -0.16989 5.33350 -5.17902 0.15447 -10.47525 9.29162 -1.18363
magnitude: 1.20570 au
magnitude: 3.06464 debye
