program: Orca
programVersion: 5.0.2
elementType: O O C C C C C C C C C C C C C C C C C C H H H H H H H H H H H H H H H H H H H H H H H H H H
charge: 0
multiplicity: 1
keywords: wb97x-d3
keywords: def2-TZVPP
keywords: def2/J RIJCOSX
keywords: DEFGRID2
keywords: scfconv7
keywords: smallprint printgap noloewdin
keywords: NOSOSCF
formula: C18H26O2
InChI: InChI=1/C18H26O2/c1-8-10-13(5)15(9-2)20-17(19)16-14(11-12(3)4)18(16,6)7/h2,10-11,14-16H,8H2,1,3-7H3
46 atoms
O  -0.67708 -0.979274 0.338318
O  -0.477885 0.168354 2.246789
C  2.232047 -1.871824 0.869051
C  2.156659 -0.805082 -0.167972
C  1.487899 -0.582572 1.181608
C  1.487866 -3.166601 0.64817
C  3.516219 -2.06029 1.641969
C  3.310663 0.03721 -0.569351
C  0.030299 -0.427446 1.325972
C  3.192321 1.222841 -1.173675
C  1.866287 1.854183 -1.476189
C  4.392787 2.00258 -1.613532
C  -2.088947 -0.704517 0.28175
C  -2.322545 0.602563 -0.439304
C  -2.692601 -1.830985 -0.423444
C  -1.935174 0.632412 -1.888775
C  -2.841207 1.622189 0.246904
C  -3.167931 2.989293 -0.259189
C  -3.227165 -2.736254 -1.002554
C  -4.624229 3.355873 0.012626
H  1.454026 -1.015802 -0.969362
H  2.016403 0.075107 1.862745
H  2.15892 -3.899266 0.194809
H  1.138742 -3.586492 1.593636
H  0.630219 -3.065739 -0.012956
H  4.210903 -2.694171 1.086708
H  4.023331 -1.11961 1.856924
H  3.317615 -2.550011 2.597207
H  4.306306 -0.357345 -0.387795
H  1.614346 1.746059 -2.535118
H  1.046953 1.427562 -0.899075
H  1.891342 2.9270 -1.27341
H  4.424547 2.981616 -1.128358
H  5.32597 1.485086 -1.390858
H  4.363586 2.194025 -2.689659
H  -2.504908 -0.660655 1.291693
H  -2.723978 0.215144 -2.519593
H  -1.734821 1.641781 -2.242187
H  -1.037394 0.042453 -2.078987
H  -3.076403 1.45886 1.296213
H  -2.95895 3.082739 -1.324935
H  -2.522843 3.714278 0.247398
H  -3.702199 -3.544623 -1.512319
H  -4.851607 3.3180 1.079219
H  -4.842169 4.366469 -0.334333
H  -5.307523 2.674285 -0.49585
elementType: O C H
totalener: -852.00824811 hartree
nucrepener: 1581.50401994 hartree
electener: -2433.51226805 hartree
oneelecener: -4296.34003142 hartree
twoeener: 1862.82776337 hartree
cpcmener: -0.02105038 hartree
kineticenergy: 847.97600127 hartree
xcener: -85.214247613804 hartree
chargesum: 0.0000000
charge: -0.275618 -0.463400 0.146468 -0.009544 -0.105611 -0.267253 -0.296013 -0.307513 0.397889 0.000940 -0.244352 -0.226211 0.136393 -0.126331 -0.523677 -0.305585 -0.080400 -0.074127 0.202786 -0.265189 0.107533 0.089826 0.093077 0.100129 0.089433 0.099872 0.090974 0.098976 0.123667 0.106794 0.064649 0.096135 0.094715 0.087936 0.094883 0.119434 0.118517 0.109914 0.102853 0.114447 0.063306 0.076017 0.282969 0.085823 0.090322 0.084148
qa: -0.2756 -0.4634 0.1465 -0.0095 -0.1056 -0.2673 -0.2960 -0.3075 0.3979 0.0009 -0.2444 -0.2262 0.1364 -0.1263 -0.5237 -0.3056 -0.0804 -0.0741 0.2028 -0.2652 0.1075 0.0898 0.0931 0.1001 0.0894 0.0999 0.0910 0.0990 0.1237 0.1068 0.0646 0.0961 0.0947 0.0879 0.0949 0.1194 0.1185 0.1099 0.1029 0.1144 0.0633 0.0760 0.2830 0.0858 0.0903 0.0841
va: 2.1060 2.0457 3.7306 3.7894 3.8282 3.8917 3.9173 3.8675 4.1737 3.7034 3.9479 3.9309 3.9055 3.6820 3.9230 3.9443 3.8419 3.9115 3.4178 3.9224 1.0162 1.0293 1.0015 0.9999 1.0100 0.9988 1.0019 1.0023 1.0048 0.9958 1.0095 1.0031 0.9966 1.0074 0.9948 1.0266 0.9958 1.0021 1.0028 1.0160 1.0155 1.0049 0.9477 1.0025 1.0048 1.0029
dispcorr: -0.022272120 hartree
energy: -852.030520230558
dipole: 6.45203 -6.12717 0.32485 10.21147 -10.18763 0.02384 -8.01491 6.77454 -1.24037
magnitude: 1.28243 au
magnitude: 3.25968 debye
