program: Orca
programVersion: 5.0.2
elementType: O O C C C C C C C C C C C C C C C C C C H H H H H H H H H H H H H H H H H H H H H H H H H H
charge: 0
multiplicity: 1
keywords: wb97x-d3
keywords: def2-TZVPP
keywords: def2/J RIJCOSX
keywords: DEFGRID2
keywords: scfconv7
keywords: smallprint printgap noloewdin
keywords: NOSOSCF
formula: C18H26O2
InChI: InChI=1/C18H26O2/c1-8-10-13(5)15(9-2)20-17(19)16-14(11-12(3)4)18(16,6)7/h2,10-11,14-16H,8H2,1,3-7H3
46 atoms
O  -0.759798 0.205225 0.172432
O  0.269379 -0.522732 2.02243
C  2.461318 1.549299 0.967651
C  2.89046 0.136368 0.768872
C  1.51916 0.56347 0.28904
C  2.176725 2.037268 2.36585
C  3.016891 2.620825 0.060814
C  3.935839 -0.250895 -0.213558
C  0.316512 0.02685 0.947933
C  3.892374 -1.338329 -0.98757
C  2.75163 -2.309334 -0.982843
C  4.999698 -1.663931 -1.942754
C  -2.015151 -0.359419 0.594242
C  -3.097499 0.495378 -0.028673
C  -2.035735 -1.770538 0.22277
C  -3.202452 1.85129 0.601649
C  -3.845555 0.041867 -1.034772
C  -4.946606 0.752255 -1.752845
C  -2.021986 -2.933797 -0.074555
C  -6.27108 0.002973 -1.635092
H  2.863604 -0.466613 1.674153
H  1.407775 0.711534 -0.779374
H  1.424997 2.82961 2.360692
H  1.829597 1.249531 3.031912
H  3.087559 2.453035 2.802105
H  2.330032 3.467566 0.00193
H  3.968486 2.996697 0.443008
H  3.185374 2.263782 -0.955582
H  4.807119 0.395942 -0.276375
H  3.120428 -3.335053 -0.90409
H  2.046649 -2.148348 -0.169177
H  2.193763 -2.255201 -1.922233
H  4.622088 -1.753085 -2.965074
H  5.784682 -0.907549 -1.938559
H  5.457179 -2.626571 -1.699641
H  -2.099802 -0.287213 1.683899
H  -3.984571 2.463487 0.158557
H  -3.416757 1.7642 1.670251
H  -2.26612 2.406959 0.514068
H  -3.66594 -0.970726 -1.387733
H  -4.675788 0.823442 -2.811428
H  -5.069617 1.776697 -1.399593
H  -1.996448 -3.96422 -0.353681
H  -7.055718 0.51092 -2.197378
H  -6.191609 -1.013367 -2.025467
H  -6.597359 -0.065488 -0.596338
elementType: O C H
totalener: -852.01061016 hartree
nucrepener: 1540.09447886 hartree
electener: -2392.10508901 hartree
oneelecener: -4213.77769031 hartree
twoeener: 1821.67260130 hartree
cpcmener: -0.02100689 hartree
kineticenergy: 847.95969667 hartree
xcener: -85.210659567361 hartree
chargesum: -0.0000000
charge: -0.279627 -0.466746 0.145174 -0.013026 -0.111825 -0.275225 -0.283929 -0.298295 0.394171 -0.010930 -0.237894 -0.228843 0.112035 -0.153988 -0.482121 -0.251718 -0.063188 -0.082612 0.168385 -0.258383 0.102053 0.094735 0.098208 0.090891 0.095834 0.097609 0.098184 0.092984 0.120909 0.099995 0.079782 0.100696 0.093570 0.088933 0.096509 0.129029 0.097846 0.099979 0.099595 0.120165 0.073710 0.067325 0.281515 0.090448 0.084631 0.083451
qa: -0.2796 -0.4667 0.1452 -0.0130 -0.1118 -0.2752 -0.2839 -0.2983 0.3942 -0.0109 -0.2379 -0.2288 0.1120 -0.1540 -0.4821 -0.2517 -0.0632 -0.0826 0.1684 -0.2584 0.1021 0.0947 0.0982 0.0909 0.0958 0.0976 0.0982 0.0930 0.1209 0.1000 0.0798 0.1007 0.0936 0.0889 0.0965 0.1290 0.0978 0.1000 0.0996 0.1202 0.0737 0.0673 0.2815 0.0904 0.0846 0.0835
va: 2.1035 2.0412 3.7075 3.8130 3.8177 3.8953 3.9063 3.8930 4.1478 3.7080 3.9370 3.9324 3.8531 3.8176 3.9690 3.9374 3.7485 3.9289 3.5046 3.9099 1.0278 1.0308 1.0000 1.0176 1.0010 1.0033 1.0001 1.0022 1.0042 1.0006 1.0147 0.9983 0.9964 1.0062 0.9962 1.0113 1.0083 0.9987 1.0048 1.0135 1.0031 1.0147 0.9496 1.0047 1.0033 1.0042
dispcorr: -0.020203957 hartree
energy: -852.030814112450
dipole: 1.07179 -1.22334 -0.15155 6.39590 -5.78159 0.61431 -7.95512 6.88639 -1.06873
magnitude: 1.24199 au
magnitude: 3.15689 debye
