program: Orca
programVersion: 5.0.2
elementType: O O C C C C C C C C C C C C C C C C C C H H H H H H H H H H H H H H H H H H H H H H H H H H
charge: 0
multiplicity: 1
keywords: wb97x-d3
keywords: def2-TZVPP
keywords: def2/J RIJCOSX
keywords: DEFGRID2
keywords: scfconv7
keywords: smallprint printgap noloewdin
keywords: NOSOSCF
formula: C18H26O2
InChI: InChI=1/C18H26O2/c1-8-10-13(5)15(9-2)20-17(19)16-14(11-12(3)4)18(16,6)7/h2,10-11,14-16H,8H2,1,3-7H3
46 atoms
O  -0.757089 -0.731684 0.533063
O  -0.84138 0.898296 2.0600
C  2.134039 -1.140446 1.486491
C  2.101684 -0.373773 0.198589
C  1.275269 0.10749 1.381076
C  1.512505 -2.515972 1.527512
C  3.339867 -1.022447 2.388526
C  3.223161 0.46639 -0.26668
C  -0.198762 0.139022 1.373632
C  3.736808 0.495982 -1.500964
C  3.265281 -0.350197 -2.644565
C  4.859994 1.429409 -1.840998
C  -2.185739 -0.68704 0.361336
C  -2.542314 0.328609 -0.693388
C  -2.586656 -2.036407 -0.025277
C  -2.05311 0.062151 -2.087325
C  -3.262834 1.396687 -0.35169
C  -3.69709 2.482576 -1.289676
C  -2.947881 -3.132314 -0.356042
C  -4.849914 3.310248 -0.739259
H  1.525093 -0.854768 -0.583153
H  1.677202 0.964063 1.911541
H  0.759003 -2.677083 0.760341
H  2.289865 -3.268062 1.377689
H  1.05407 -2.712469 2.499149
H  4.141458 -1.677778 2.041271
H  3.738813 -0.009965 2.438234
H  3.085208 -1.322679 3.406917
H  3.655138 1.134942 0.472582
H  2.795502 0.267567 -3.415043
H  4.110709 -0.848062 -3.125624
H  2.552354 -1.121291 -2.359157
H  5.743122 0.878149 -2.175352
H  4.582695 2.093328 -2.664611
H  5.152662 2.050893 -0.994585
H  -2.670616 -0.4349 1.308197
H  -1.170408 -0.577843 -2.096422
H  -2.814086 -0.438909 -2.690958
H  -1.7862 0.983976 -2.603558
H  -3.562902 1.506652 0.687524
H  -3.978754 2.055816 -2.255697
H  -2.847333 3.143157 -1.495337
H  -3.267177 -4.108537 -0.646044
H  -4.575738 3.800259 0.19645
H  -5.144471 4.088087 -1.444287
H  -5.728136 2.692622 -0.544393
elementType: O C H
totalener: -852.00927030 hartree
nucrepener: 1554.03580138 hartree
electener: -2406.04507168 hartree
oneelecener: -4241.44103377 hartree
twoeener: 1835.39596209 hartree
cpcmener: -0.02178303 hartree
kineticenergy: 847.97119077 hartree
xcener: -85.212802737515 hartree
chargesum: 0.0000000
charge: -0.278921 -0.464202 0.101720 0.074368 -0.122765 -0.270207 -0.272485 -0.295627 0.416103 -0.040500 -0.258226 -0.220290 0.133011 -0.109021 -0.513033 -0.299416 -0.092379 -0.079490 0.192693 -0.272232 0.093683 0.086089 0.087757 0.093401 0.100265 0.096567 0.087461 0.097821 0.116809 0.099676 0.093360 0.089999 0.093673 0.092327 0.087976 0.120622 0.099427 0.113836 0.108719 0.110038 0.077438 0.080751 0.282889 0.084284 0.089687 0.086345
qa: -0.2789 -0.4642 0.1017 0.0744 -0.1228 -0.2702 -0.2725 -0.2956 0.4161 -0.0405 -0.2582 -0.2203 0.1330 -0.1090 -0.5130 -0.2994 -0.0924 -0.0795 0.1927 -0.2722 0.0937 0.0861 0.0878 0.0934 0.1003 0.0966 0.0875 0.0978 0.1168 0.0997 0.0934 0.0900 0.0937 0.0923 0.0880 0.1206 0.0994 0.1138 0.1087 0.1100 0.0774 0.0808 0.2829 0.0843 0.0897 0.0863
va: 2.1117 2.0474 3.6950 3.7312 3.8655 3.9115 3.9169 3.8748 4.1806 3.7573 3.9450 3.9240 3.9175 3.6340 3.8978 3.9532 3.8468 3.8971 3.4242 3.9542 1.0189 1.0344 1.0106 1.0004 0.9999 1.0017 1.0067 1.0013 1.0118 0.9956 0.9982 1.0089 0.9965 0.9956 1.0090 1.0269 1.0103 0.9927 0.9975 1.0139 0.9999 1.0014 0.9477 0.9982 1.0053 1.0001
dispcorr: -0.020410021 hartree
energy: -852.029680325416
dipole: 8.95578 -8.41923 0.53655 5.63447 -6.14427 -0.50980 -10.53963 9.35687 -1.18276
magnitude: 1.39524 au
magnitude: 3.54642 debye
