program: Gaussian 09
title: 000072347
version: EM64L-G09RevD.01
frameworkgroup: C1[X(C15H14N6O)]
method: RPBEPBE
basis: SDD
operation: Freq
keyword: #p
keyword: freq=noraman
keyword: PBEPBE/SDD
title: #p freq=noraman PBEPBE/SDD
converged: NO YES NO NO
title: Mulliken charges:
elementType: O N N N N N N C C C C C C C C C C C C C C C H H H H H H H H H H H H H H
charge: -0.267537 -0.226480 -0.223329 -0.028917 -0.071037 -0.013061 -0.061330 0.291275 0.254834 0.026529 -0.327589 0.129417 0.091375 -0.481451 -0.287381 -0.642727 0.295413 -0.699557 -0.245725 -0.382627 -0.201527 -0.350844 0.239329 0.217695 0.278728 0.247893 0.234973 0.235032 0.274377 0.219486 0.254035 0.214833 0.278331 0.248290 0.235330 0.243943
chargesum: 0.00000
title: Mulliken charges with hydrogens summed into heavy atoms:
elementType: O N N N N N N C C C C C C C C C C C C C C C
charge: -0.267537 -0.226480 -0.223329 -0.028917 -0.071037 -0.013061 -0.061330 0.291275 0.254834 0.026529 0.129435 0.129417 0.091375 -0.202723 -0.039488 0.101656 0.295413 -0.011203 0.032606 -0.134337 0.033802 -0.106900
polarizability: 3.40949784e+02 9.33409235e-01 2.11949090e+02 6.94754130e+00 2.34167500e+00 1.36734342e+02
1716.lowfreq: -3.9932 -3.2332 -0.0005 -0.0004 -0.0003 8.0837 38.7816 51.8565 71.6221
frequency: 38.7410 51.8510 71.5890 85.9135 90.0450 104.5616 111.9681 138.8580 163.3306 172.1120 195.2733 222.0852 239.6367 258.4553 289.2097 297.1699 314.7912 337.1957 364.7395 387.8215 395.9659 410.8044 431.5464 450.7943 463.1403 486.3946 514.9676 542.1171 570.2876 595.2148 614.1387 622.6000 651.0201 653.0740 699.4921 725.2502 733.1304 775.8442 791.4339 809.8221 815.7665 828.2075 853.9127 879.4917 934.7178 937.6005 947.2978 962.8332 977.9853 989.8161 1047.0305 1055.2345 1075.4567 1098.1430 1109.6779 1111.4448 1120.4746 1136.5085 1156.0896 1174.5586 1231.0109 1247.8986 1252.0232 1279.5706 1292.5189 1313.2032 1324.5165 1329.5872 1364.1316 1371.4996 1381.2500 1388.0044 1417.2876 1423.1776 1425.2106 1436.5431 1458.2885 1466.4173 1469.8027 1489.6281 1490.5554 1503.7699 1533.7969 1561.8143 1578.0354 1585.4773 1609.5175 2046.4076 2987.9393 2992.8905 2995.0022 3067.2378 3082.9786 3086.7645 3111.4691 3129.1887 3129.2904 3142.3966 3158.4167 3166.1803 3178.5044 3179.9128
redmass: 7.3092 5.8892 4.4473 6.4291 5.0463 4.9996 4.1553 2.7400 1.2176 2.8441 1.8775 3.0388 5.6863 2.6394 4.7867 3.0942 4.4177 6.1091 5.0373 5.7669 5.0352 5.2079 4.4683 12.2955 4.2667 5.0432 4.6223 3.9516 4.7888 6.8311 4.0083 5.4297 7.1154 7.0228 7.5224 4.1301 5.7920 2.6894 1.4978 1.4367 2.0851 2.8697 3.8066 1.5019 2.0484 1.5093 1.4446 3.7791 1.4370 4.9242 3.3594 3.1479 2.1867 2.0656 2.5249 1.4670 1.6720 1.7634 1.4187 1.9980 2.3764 1.7846 2.4372 2.4802 1.9489 1.6437 4.9460 4.1246 1.9572 1.9839 6.4330 1.2757 2.8383 2.0261 1.7328 2.1709 1.1185 1.0538 1.1690 1.0541 1.1593 2.7357 6.1600 7.2446 7.8662 6.8538 6.5799 13.9724 1.0392 1.0365 1.0617 1.0997 1.0941 1.0989 1.1007 1.0900 1.1025 1.0885 1.0902 1.0958 1.0921 1.0996
irintensity: 0.3059 3.0152 0.6447 0.9111 1.6979 0.7027 4.8645 1.4257 0.7490 0.7323 0.5892 3.1073 2.0964 2.3309 1.3785 2.4204 7.7023 1.0239 8.7579 4.0480 6.0346 5.0731 4.4812 3.5195 9.2269 4.0897 0.7761 3.2112 8.8807 25.8788 7.4161 6.1029 1.5856 10.4087 24.2077 2.9722 4.5179 36.1958 12.3661 41.2762 15.9866 3.4201 9.1067 27.0272 11.9437 5.5959 1.0244 23.6702 1.4437 13.1050 1.5878 11.8843 1.0730 7.3845 10.5901 31.8898 26.8168 40.8766 11.5710 13.3264 39.2472 13.4360 25.5704 60.5194 37.9198 32.7306 32.0672 134.8256 98.1492 61.4741 9.5758 23.5282 84.8216 101.6538 115.7812 40.0189 15.6069 2.3029 118.3418 6.9324 11.5536 324.9631 17.7863 260.8579 187.9721 135.8626 68.5725 712.7294 39.1989 31.7663 29.0048 8.8951 18.9023 33.9648 26.8163 21.5262 6.0557 4.7028 3.8009 5.8991 0.4310 18.9398
temp: 298.150 k
press: 1.00000 atm
elementType: 8 7 7 7 7 7 7 6 6 6 6 6 6 6 6 6 6 6 6 6 6 6 1 1 1 1 1 1 1 1 1 1 1 1 1 1
symmnumber: 1
zpe: 716346.3 jmol-1
zpe.correction: 0.272842 hartree
zpe.thermalcorrener: 0.291864 hartree
zpe.thermalcorrenthalpy: 0.292808 hartree
zpe.thermalcorrgfe: 0.225725 hartree
zpe.sumelectzpe: -982.128162 hartree
zpe.sumelectthermal: -982.109140 hartree
zpe.sumelectthermalent: -982.108196 hartree
zpe.sumelectthermalfe: -982.175279 hartree
dipole: -0.0405 -0.0432 0.4690
dipole: 0.4728
quadrupole: -142.8175 -123.9699 -123.3911
quadrupole: 13.9165 9.4562 -0.4227
quadrupole: -12.7579 6.0896 6.6684 13.9165 9.4562 -0.4227
hfenergy: -982.4010041 hartree
pointgroup: C01 [X(C15H14N6O1)]
dipole: 0.0170755 0.0209976 -0.1840193 debye
polarizability: 340.2201146|-10.0965982|210.3544891|7.2425285|12.8427418|139.0586118 unknown
InChI: InChI=1S/C15H14N6O/c1-3-21-13-9-10(18-19-16)6-7-12(13)20(2)15(22)11-5-4-8-17-14(11)21/h4-9H,3H2,1-2H3
charge 0 multiplicity 1
36 atoms
O  2.878312 2.559057 0.423795
N  0.605789 -0.784191 -0.914489
N  0.700656 2.051157 -0.182392
N  2.269781 -2.133139 0.083716
N  -4.147373 -0.933571 0.134542
N  -5.247605 -0.459331 0.542108
N  -6.356589 -0.201685 0.880277
C  -0.557113 -0.099057 -0.427437
C  -0.493935 1.269891 -0.031005
C  1.721855 -0.884652 -0.043653
C  0.418872 -1.86552 -1.928195
C  2.254407 0.252202 0.644029
C  1.963135 1.68258 0.302447
C  -1.790554 -0.786675 -0.337588
C  -1.672962 1.901781 0.440742
C  0.559327 3.466648 -0.602868
C  -2.959114 -0.131599 0.109612
C  1.554399 -1.877724 -2.966455
C  3.317449 0.028244 1.553626
C  -2.904419 1.22782 0.507471
C  3.833049 -1.268685 1.745398
C  3.29829 -2.310251 0.954247
H  0.350187 -2.853682 -1.434252
H  -0.537228 -1.655031 -2.437458
H  -1.857459 -1.843928 -0.604597
H  -1.624929 2.949464 0.752576
H  0.39372 4.142743 0.25714
H  -0.282092 3.547573 -1.30891
H  1.49585 3.779723 -1.088387
H  1.641914 -0.896746 -3.465649
H  2.51847 -2.126786 -2.494733
H  1.342808 -2.643108 -3.735631
H  3.7551 0.898604 2.052079
H  -3.799364 1.748325 0.864724
H  4.648956 -1.463129 2.446457
H  3.70151 -3.328123 1.011415
