program: Orca
programVersion: 5.0.2
elementType: O O C C C C C C C C C C C C C C C C C C H H H H H H H H H H H H H H H H H H H H H H H H H H
charge: 0
multiplicity: 1
keywords: wb97x-d3
keywords: def2-TZVPP
keywords: def2/J RIJCOSX
keywords: DEFGRID2
keywords: scfconv7
keywords: smallprint printgap noloewdin
keywords: NOSOSCF
formula: C18H26O2
InChI: InChI=1/C18H26O2/c1-8-10-13(5)15(9-2)20-17(19)16-14(11-12(3)4)18(16,6)7/h2,10-11,14-16H,8H2,1,3-7H3
46 atoms
O  -0.849322 0.182738 0.320759
O  0.221047 -0.799301 2.019735
C  2.410429 1.385152 1.30125
C  2.803885 0.035472 0.809715
C  1.427223 0.572015 0.469225
C  2.166969 1.592045 2.775365
C  2.971383 2.605855 0.612343
C  3.805504 -0.168242 -0.268985
C  0.243251 -0.085991 1.045962
C  3.708262 -1.088677 -1.232042
C  2.54653 -2.026102 -1.363723
C  4.766361 -1.239807 -2.281619
C  -2.074176 -0.486384 0.674545
C  -3.201651 0.349919 0.110365
C  -2.009614 -1.863139 0.193762
C  -3.394706 1.640665 0.847307
C  -3.9306 -0.073248 -0.922319
C  -5.066066 0.631428 -1.591718
C  -1.922052 -2.996174 -0.192847
C  -4.7152 1.014196 -3.027468
H  2.786704 -0.738965 1.573718
H  1.287962 0.92855 -0.545124
H  3.084408 1.936822 3.255891
H  1.404076 2.354562 2.943454
H  1.854456 0.685293 3.2890
H  2.306948 3.461944 0.744991
H  3.941214 2.873822 1.036967
H  3.10777 2.458183 -0.459143
H  4.685842 0.468702 -0.246238
H  1.936397 -1.764865 -2.23227
H  2.892879 -3.048491 -1.529245
H  1.894235 -2.036826 -0.493135
H  4.34161 -1.127689 -3.282868
H  5.56543 -0.506702 -2.171593
H  5.214651 -2.236146 -2.247339
H  -2.17435 -0.507104 1.765376
H  -4.128052 2.289836 0.37669
H  -3.727119 1.453969 1.870929
H  -2.463116 2.203506 0.918891
H  -3.683686 -1.035996 -1.361974
H  -5.376789 1.519488 -1.040624
H  -5.930064 -0.039518 -1.606452
H  -1.850211 -4.005505 -0.531609
H  -3.890238 1.727148 -3.054608
H  -4.418918 0.141635 -3.611633
H  -5.568356 1.472191 -3.5291
elementType: O C H
totalener: -852.01067963 hartree
nucrepener: 1547.63717574 hartree
electener: -2399.64785537 hartree
oneelecener: -4228.90554571 hartree
twoeener: 1829.25769034 hartree
cpcmener: -0.02110180 hartree
kineticenergy: 847.97942834 hartree
xcener: -85.214858912022 hartree
chargesum: -0.0000000
charge: -0.281036 -0.465860 0.142972 -0.012846 -0.102171 -0.277096 -0.283736 -0.302757 0.390037 -0.008637 -0.238811 -0.228494 0.128295 -0.156462 -0.472015 -0.256102 -0.064762 -0.087102 0.148409 -0.259612 0.102356 0.093840 0.095136 0.098606 0.092565 0.097538 0.098645 0.092960 0.121509 0.102314 0.100396 0.078888 0.093715 0.088960 0.096163 0.128319 0.097221 0.102555 0.098759 0.122834 0.067290 0.075232 0.281048 0.085250 0.085267 0.090421
qa: -0.2810 -0.4659 0.1430 -0.0128 -0.1022 -0.2771 -0.2837 -0.3028 0.3900 -0.0086 -0.2388 -0.2285 0.1283 -0.1565 -0.4720 -0.2561 -0.0648 -0.0871 0.1484 -0.2596 0.1024 0.0938 0.0951 0.0986 0.0926 0.0975 0.0986 0.0930 0.1215 0.1023 0.1004 0.0789 0.0937 0.0890 0.0962 0.1283 0.0972 0.1026 0.0988 0.1228 0.0673 0.0752 0.2810 0.0852 0.0853 0.0904
va: 2.1063 2.0399 3.7067 3.8112 3.8211 3.8937 3.9072 3.8974 4.1430 3.7079 3.9392 3.9327 3.8343 3.8295 3.9076 3.9421 3.7505 3.9285 3.5440 3.9094 1.0277 1.0310 1.0014 0.9993 1.0176 1.0032 0.9999 1.0019 1.0044 0.9980 1.0007 1.0133 0.9963 1.0063 0.9963 1.0078 1.0069 0.9977 1.0067 1.0125 1.0125 1.0032 0.9503 1.0032 1.0031 1.0051
dispcorr: -0.020318438 hartree
energy: -852.030998065226
dipole: 2.93751 -3.13101 -0.19350 8.65866 -7.93204 0.72661 -9.74276 8.77901 -0.96375
magnitude: 1.22239 au
magnitude: 3.10706 debye
