program: Orca
programVersion: 5.0.2
elementType: O O C C C C C C C C C C C C C C C C C C H H H H H H H H H H H H H H H H H H H H H H H H H H
charge: 0
multiplicity: 1
keywords: wb97x-d3
keywords: def2-TZVPP
keywords: def2/J RIJCOSX
keywords: DEFGRID2
keywords: scfconv7
keywords: smallprint printgap noloewdin
keywords: NOSOSCF
formula: C18H26O2
InChI: InChI=1/C18H26O2/c1-8-10-13(5)15(9-2)20-17(19)16-14(11-12(3)4)18(16,6)7/h2,10-11,14-16H,8H2,1,3-7H3
46 atoms
O  -1.04191 -1.069185 -0.403863
O  -0.159813 -0.476578 1.565189
C  1.651983 1.180978 -0.475878
C  2.432213 0.096146 0.208689
C  1.116163 -0.242578 -0.450333
C  1.016504 2.251177 0.37691
C  2.104087 1.68947 -1.822692
C  3.678636 -0.464136 -0.354152
C  -0.055652 -0.596838 0.369792
C  4.855737 -0.566478 0.271525
C  5.121736 -0.102959 1.670944
C  6.040222 -1.176852 -0.415856
C  -2.277839 -1.390291 0.226555
C  -3.123275 -0.173936 0.570004
C  -2.990848 -2.266458 -0.700296
C  -4.204427 -0.487948 1.556326
C  -2.871396 1.017024 0.030477
C  -3.585987 2.305877 0.287718
C  -3.605518 -2.98195 -1.442622
C  -3.955997 3.01966 -1.008245
H  2.384326 0.141072 1.291645
H  1.166488 -0.759407 -1.402921
H  1.711261 3.085375 0.494795
H  0.112396 2.645259 -0.093124
H  0.753777 1.907505 1.375579
H  2.879522 2.449685 -1.705847
H  2.506204 0.903372 -2.460776
H  1.269898 2.149109 -2.356584
H  3.617967 -0.83045 -1.375227
H  5.935294 0.627466 1.680402
H  4.263116 0.359734 2.153608
H  5.450135 -0.934678 2.299865
H  6.869975 -0.467106 -0.47505
H  6.414413 -2.040804 0.140248
H  5.807304 -1.505995 -1.428694
H  -2.086807 -1.953282 1.148361
H  -4.768205 -1.375442 1.258912
H  -3.777462 -0.703098 2.539527
H  -4.916948 0.324777 1.675739
H  -2.049391 1.104653 -0.675225
H  -2.925613 2.957696 0.870039
H  -4.478779 2.158844 0.89656
H  -4.149847 -3.610225 -2.111953
H  -4.441666 3.974595 -0.803699
H  -3.07174 3.22416 -1.614718
H  -4.640286 2.421409 -1.611616
elementType: O C H
totalener: -852.01144774 hartree
nucrepener: 1547.44841615 hartree
electener: -2399.45986389 hartree
oneelecener: -4228.32833414 hartree
twoeener: 1828.86847024 hartree
cpcmener: -0.02223989 hartree
kineticenergy: 847.96300160 hartree
xcener: -85.214218287220 hartree
chargesum: -0.0000000
charge: -0.286428 -0.450448 0.118505 0.035100 -0.096925 -0.274321 -0.267577 -0.279557 0.354909 -0.043833 -0.252063 -0.219845 0.180110 -0.090955 -0.567876 -0.255964 -0.145849 -0.080154 0.234438 -0.258464 0.091849 0.090880 0.101561 0.089507 0.095296 0.097882 0.088533 0.097652 0.117244 0.094919 0.089513 0.096122 0.092468 0.093447 0.087839 0.122608 0.101171 0.105648 0.096637 0.113138 0.073524 0.072334 0.281856 0.089716 0.082608 0.083243
qa: -0.2864 -0.4504 0.1185 0.0351 -0.0969 -0.2743 -0.2676 -0.2796 0.3549 -0.0438 -0.2521 -0.2198 0.1801 -0.0910 -0.5679 -0.2560 -0.1458 -0.0802 0.2344 -0.2585 0.0918 0.0909 0.1016 0.0895 0.0953 0.0979 0.0885 0.0977 0.1172 0.0949 0.0895 0.0961 0.0925 0.0934 0.0878 0.1226 0.1012 0.1056 0.0966 0.1131 0.0735 0.0723 0.2819 0.0897 0.0826 0.0832
va: 2.1122 2.0541 3.6906 3.7902 3.8357 3.8966 3.9026 3.8744 4.2288 3.7544 3.9425 3.9225 3.8368 3.7734 4.0432 3.9458 3.8444 3.9028 3.3730 3.9167 1.0338 1.0380 1.0027 1.0021 1.0167 1.0022 1.0052 1.0026 1.0103 0.9974 1.0097 0.9968 0.9966 0.9958 1.0088 1.0129 0.9981 0.9965 1.0079 1.0167 1.0044 1.0147 0.9483 1.0052 1.0026 1.0038
dispcorr: -0.020532148 hartree
energy: -852.031979890282
dipole: 8.59909 -8.45981 0.13928 14.78283 -14.35170 0.43113 -0.70555 0.12190 -0.58365
magnitude: 0.73887 au
magnitude: 1.87805 debye
