program: Orca
programVersion: 5.0.2
elementType: O O C C C C C C C C C C C C C C C C C C H H H H H H H H H H H H H H H H H H H H H H H H H H
charge: 0
multiplicity: 1
keywords: wb97x-d3
keywords: def2-TZVPP
keywords: def2/J RIJCOSX
keywords: DEFGRID2
keywords: scfconv7
keywords: smallprint printgap noloewdin
keywords: NOSOSCF
formula: C18H26O2
InChI: InChI=1/C18H26O2/c1-8-10-13(5)15(9-2)20-17(19)16-14(11-12(3)4)18(16,6)7/h2,10-11,14-16H,8H2,1,3-7H3
46 atoms
O  -0.864868 -1.028545 -0.388602
O  -0.151159 0.030921 1.447522
C  1.616564 1.491831 -0.759999
C  2.432794 0.598773 0.110848
C  1.178637 0.048538 -0.5452
C  0.845848 2.625375 -0.12955
C  2.103103 1.816293 -2.151918
C  3.770292 0.089216 -0.281563
C  0.017624 -0.288189 0.29554
C  4.4121 -0.910942 0.328942
C  3.839123 -1.681938 1.478236
C  5.781805 -1.336802 -0.102505
C  -2.057112 -1.413802 0.290973
C  -3.075459 -0.293095 0.424615
C  -2.624901 -2.522823 -0.47214
C  -4.085635 -0.556316 1.497315
C  -3.026478 0.785576 -0.35445
C  -3.937462 1.972943 -0.297355
C  -3.128778 -3.434515 -1.068806
C  -3.303831 3.130586 0.471583
H  2.307967 0.781768 1.174673
H  1.317553 -0.60018 -1.402771
H  0.517464 2.412964 0.885823
H  1.473743 3.51778 -0.088225
H  -0.03593 2.875476 -0.723586
H  1.26855 2.124325 -2.784553
H  2.817788 2.641861 -2.126482
H  2.587676 0.971517 -2.640915
H  4.265887 0.585502 -1.110806
H  2.802082 -1.429345 1.695717
H  3.885019 -2.756245 1.280829
H  4.422014 -1.513769 2.388526
H  6.495644 -1.262023 0.722387
H  5.785609 -2.383832 -0.417774
H  6.160474 -0.735364 -0.929159
H  -1.806891 -1.781453 1.293531
H  -3.613507 -0.527446 2.483081
H  -4.897955 0.16702 1.49858
H  -4.530259 -1.54913 1.391847
H  -2.228822 0.863111 -1.088053
H  -4.899214 1.72188 0.15224
H  -4.151985 2.299532 -1.31829
H  -3.571295 -4.23331 -1.621364
H  -3.951185 4.00885 0.462435
H  -3.124566 2.857028 1.512478
H  -2.345504 3.421231 0.037279
elementType: O C H
totalener: -852.00976932 hartree
nucrepener: 1566.36153418 hartree
electener: -2418.37130350 hartree
oneelecener: -4266.25381922 hartree
twoeener: 1847.88251572 hartree
cpcmener: -0.02117847 hartree
kineticenergy: 847.95708530 hartree
xcener: -85.212392261341 hartree
chargesum: -0.0000000
charge: -0.288823 -0.458644 0.169711 -0.054587 -0.066767 -0.287220 -0.295988 -0.271369 0.354524 -0.014974 -0.248086 -0.228706 0.171686 -0.093552 -0.560634 -0.253785 -0.141161 -0.094364 0.234490 -0.269293 0.101616 0.093281 0.098516 0.101645 0.095268 0.098492 0.102667 0.090264 0.123219 0.080021 0.094252 0.099945 0.093937 0.094125 0.088259 0.123389 0.105239 0.095115 0.103386 0.121119 0.073073 0.074520 0.281835 0.095262 0.087706 0.081390
qa: -0.2888 -0.4586 0.1697 -0.0546 -0.0668 -0.2872 -0.2960 -0.2714 0.3545 -0.0150 -0.2481 -0.2287 0.1717 -0.0936 -0.5606 -0.2538 -0.1412 -0.0944 0.2345 -0.2693 0.1016 0.0933 0.0985 0.1016 0.0953 0.0985 0.1027 0.0903 0.1232 0.0800 0.0943 0.0999 0.0939 0.0941 0.0883 0.1234 0.1052 0.0951 0.1034 0.1211 0.0731 0.0745 0.2818 0.0953 0.0877 0.0814
va: 2.1159 2.0395 3.7107 3.8536 3.8099 3.8763 3.9106 3.8815 4.1867 3.7108 3.9429 3.9290 3.8467 3.7255 4.0428 3.9465 3.8294 3.9182 3.3730 3.9144 1.0250 1.0335 1.0145 1.0040 1.0000 1.0031 0.9982 1.0015 1.0035 1.0167 0.9987 0.9980 0.9956 0.9966 1.0072 1.0139 0.9973 1.0078 0.9986 1.0166 1.0081 1.0046 0.9484 1.0063 1.0011 1.0035
dispcorr: -0.021471679 hartree
energy: -852.031240997111
dipole: 6.51830 -6.41689 0.10141 11.86367 -11.81899 0.04468 0.47779 -1.09041 -0.61262
magnitude: 0.62256 au
magnitude: 1.58242 debye
