program: Orca
programVersion: 5.0.2
elementType: O O C C C C C C C C C C C C C C C C C C H H H H H H H H H H H H H H H H H H H H H H H H H H
charge: 0
multiplicity: 1
keywords: wb97x-d3
keywords: def2-TZVPP
keywords: def2/J RIJCOSX
keywords: DEFGRID2
keywords: scfconv7
keywords: smallprint printgap noloewdin
keywords: NOSOSCF
formula: C18H26O2
InChI: InChI=1/C18H26O2/c1-8-10-13(5)15(9-2)20-17(19)16-14(11-12(3)4)18(16,6)7/h2,10-11,14-16H,8H2,1,3-7H3
46 atoms
O  -0.733313 -0.896707 -0.156244
O  -0.027725 0.014703 1.760512
C  1.766697 1.641588 -0.28303
C  2.582883 0.638362 0.458706
C  1.308493 0.188512 -0.219561
C  1.032228 2.709264 0.489578
C  2.229604 2.106149 -1.642666
C  3.896164 0.159922 -0.046543
C  0.148703 -0.21646 0.589063
C  4.311706 -1.108753 -0.023052
C  3.482057 -2.238228 0.509431
C  5.655694 -1.499603 -0.556628
C  -1.952279 -1.282888 0.472249
C  -2.943786 -0.138694 0.616021
C  -2.522051 -2.346829 -0.350708
C  -3.972971 -0.39147 1.672065
C  -2.865511 0.937177 -0.164471
C  -3.779177 2.122167 -0.165568
C  -3.025553 -3.219967 -1.002538
C  -4.686909 2.126756 -1.393477
H  2.500728 0.708539 1.541518
H  1.423002 -0.362805 -1.146188
H  1.661354 3.598101 0.57268
H  0.11434 3.005735 -0.022797
H  0.769314 2.405332 1.500761
H  1.383414 2.459508 -2.235345
H  2.932751 2.93668 -1.548178
H  2.722724 1.317481 -2.211296
H  4.566088 0.916386 -0.446908
H  4.087668 -2.900403 1.133331
H  2.632943 -1.905894 1.105334
H  3.09455 -2.854369 -0.308067
H  6.192585 -0.653156 -0.98509
H  6.280549 -1.932955 0.228717
H  5.561185 -2.265591 -1.3315
H  -1.742177 -1.694427 1.46666
H  -3.510201 -0.436119 2.661419
H  -4.74789 0.371101 1.698829
H  -4.468974 -1.35276 1.514923
H  -2.079683 0.97925 -0.913863
H  -3.170218 3.030842 -0.170358
H  -4.386206 2.166189 0.739398
H  -3.461187 -4.001371 -1.583757
H  -5.354456 1.26385 -1.391444
H  -5.304108 3.026037 -1.421729
H  -4.1078 2.094391 -2.317908
elementType: O C H
totalener: -852.00993202 hartree
nucrepener: 1564.99148612 hartree
electener: -2417.00141814 hartree
oneelecener: -4263.48442989 hartree
twoeener: 1846.48301174 hartree
cpcmener: -0.02076902 hartree
kineticenergy: 847.96695164 hartree
xcener: -85.213433570148 hartree
chargesum: -0.0000000
charge: -0.292081 -0.459489 0.146797 -0.002772 -0.104867 -0.277877 -0.284117 -0.307197 0.358849 -0.007753 -0.243267 -0.228278 0.178438 -0.083000 -0.568352 -0.252399 -0.144826 -0.093917 0.235484 -0.264061 0.103661 0.095470 0.098971 0.094553 0.094470 0.097956 0.099131 0.093083 0.120592 0.100472 0.084049 0.102983 0.088183 0.096400 0.093980 0.123703 0.104792 0.094252 0.101654 0.121417 0.073941 0.067875 0.282310 0.084760 0.090559 0.085466
qa: -0.2921 -0.4595 0.1468 -0.0028 -0.1049 -0.2779 -0.2841 -0.3072 0.3588 -0.0078 -0.2433 -0.2283 0.1784 -0.0830 -0.5684 -0.2524 -0.1448 -0.0939 0.2355 -0.2641 0.1037 0.0955 0.0990 0.0946 0.0945 0.0980 0.0991 0.0931 0.1206 0.1005 0.0840 0.1030 0.0882 0.0964 0.0940 0.1237 0.1048 0.0943 0.1017 0.1214 0.0739 0.0679 0.2823 0.0848 0.0906 0.0855
va: 2.1062 2.0447 3.7095 3.8142 3.8092 3.8899 3.9021 3.8963 4.1886 3.7017 3.9349 3.9339 3.8331 3.7306 4.0599 3.9505 3.8384 3.9201 3.3732 3.9089 1.0260 1.0304 1.0023 1.0008 1.0175 1.0034 1.0001 1.0026 1.0041 1.0006 1.0123 0.9975 1.0065 0.9963 0.9962 1.0150 0.9986 1.0072 0.9968 1.0165 1.0067 1.0097 0.9482 1.0019 1.0055 1.0019
dispcorr: -0.021297226 hartree
energy: -852.031229247291
dipole: 3.40670 -3.36027 0.04643 9.45935 -9.41580 0.04355 -4.43196 3.64808 -0.78387
magnitude: 0.78645 au
magnitude: 1.99901 debye
