program: Orca
programVersion: 5.0.2
elementType: O O C C C C C C C C C C C C C C C C C C H H H H H H H H H H H H H H H H H H H H H H H H H H
charge: 0
multiplicity: 1
keywords: wb97x-d3
keywords: def2-TZVPP
keywords: def2/J RIJCOSX
keywords: DEFGRID2
keywords: scfconv7
keywords: smallprint printgap noloewdin
keywords: NOSOSCF
formula: C18H26O2
InChI: InChI=1/C18H26O2/c1-8-10-13(5)15(9-2)20-17(19)16-14(11-12(3)4)18(16,6)7/h2,10-11,14-16H,8H2,1,3-7H3
46 atoms
O  -0.979321 -1.067612 -0.40196
O  -0.231113 0.203963 1.281299
C  1.894687 1.026959 -0.89217
C  2.505899 0.062422 0.07935
C  1.189145 -0.284317 -0.58315
C  1.365323 2.335936 -0.362642
C  2.474882 1.142744 -2.28087
C  3.711339 -0.730684 -0.238314
C  -0.048547 -0.332564 0.215518
C  4.837589 -0.714751 0.479823
C  5.001666 0.13143 1.71491
C  6.015182 -1.557013 0.096865
C  -2.28021 -1.158871 0.207858
C  -3.116482 0.0443 -0.143465
C  -2.871372 -2.394536 -0.29824
C  -3.426233 0.27027 -1.595351
C  -3.55076 0.844502 0.829547
C  -4.395576 2.065177 0.62096
C  -3.394419 -3.396022 -0.704476
C  -5.003873 2.588424 1.913569
H  2.413598 0.367785 1.117425
H  1.234181 -1.017307 -1.381525
H  0.539218 2.70494 -0.974719
H  1.020304 2.276504 0.667424
H  2.157863 3.086969 -0.395408
H  3.337402 1.812868 -2.28105
H  2.800873 0.185453 -2.686045
H  1.736173 1.556172 -2.970456
H  3.665636 -1.364717 -1.118866
H  4.370541 -0.219752 2.53499
H  6.030338 0.111474 2.075095
H  4.741484 1.176327 1.537769
H  6.291981 -2.23726 0.907264
H  5.822833 -2.155936 -0.79348
H  6.895227 -0.937453 -0.096571
H  -2.17972 -1.241527 1.294016
H  -2.796776 -0.329924 -2.252098
H  -4.463439 0.015996 -1.827068
H  -3.282926 1.314447 -1.876874
H  -3.27502 0.611596 1.855077
H  -5.189598 1.853696 -0.101211
H  -3.786573 2.852282 0.162055
H  -3.853055 -4.287593 -1.070069
H  -4.230949 2.862748 2.633569
H  -5.612036 3.474815 1.731188
H  -5.643773 1.840506 2.384691
elementType: O C H
totalener: -852.01021281 hartree
nucrepener: 1529.31361606 hartree
electener: -2381.32382887 hartree
oneelecener: -4192.26773061 hartree
twoeener: 1810.94390174 hartree
cpcmener: -0.02095501 hartree
kineticenergy: 847.96648959 hartree
xcener: -85.210385997098 hartree
chargesum: 0.0000000
charge: -0.286383 -0.465358 0.124123 0.042685 -0.142067 -0.284452 -0.265837 -0.298541 0.403930 -0.011892 -0.282436 -0.220903 0.157838 -0.105551 -0.510987 -0.300150 -0.107242 -0.079109 0.200031 -0.273105 0.093587 0.089592 0.097973 0.094137 0.096373 0.096682 0.087589 0.097951 0.118033 0.104363 0.094269 0.102864 0.098234 0.084204 0.095433 0.121881 0.097192 0.114914 0.108614 0.109630 0.076383 0.082358 0.282599 0.084246 0.089214 0.087091
qa: -0.2864 -0.4654 0.1241 0.0427 -0.1421 -0.2845 -0.2658 -0.2985 0.4039 -0.0119 -0.2824 -0.2209 0.1578 -0.1056 -0.5110 -0.3001 -0.1072 -0.0791 0.2000 -0.2731 0.0936 0.0896 0.0980 0.0941 0.0964 0.0967 0.0876 0.0980 0.1180 0.1044 0.0943 0.1029 0.0982 0.0842 0.0954 0.1219 0.0972 0.1149 0.1086 0.1096 0.0764 0.0824 0.2826 0.0842 0.0892 0.0871
va: 2.1132 2.0474 3.6897 3.7535 3.9019 3.9040 3.9087 3.8805 4.1880 3.6964 3.9407 3.9209 3.8670 3.6388 3.9470 3.9522 3.8600 3.8920 3.4142 3.9583 1.0277 1.0383 0.9996 1.0193 1.0007 1.0025 1.0052 1.0025 1.0091 0.9966 1.0049 0.9957 0.9926 1.0104 0.9937 1.0233 1.0169 0.9933 0.9957 1.0130 0.9998 1.0019 0.9475 0.9977 1.0056 0.9992
dispcorr: -0.019734252 hartree
energy: -852.029947063219
dipole: 8.15355 -8.01500 0.13855 13.42165 -13.17946 0.24219 -1.01869 0.22923 -0.78946
magnitude: 0.83731 au
magnitude: 2.12828 debye
