program: Orca
programVersion: 5.0.2
elementType: O O C C C C C C C C C C C C C C C C C C H H H H H H H H H H H H H H H H H H H H H H H H H H
charge: 0
multiplicity: 1
keywords: wb97x-d3
keywords: def2-TZVPP
keywords: def2/J RIJCOSX
keywords: DEFGRID2
keywords: scfconv7
keywords: smallprint printgap noloewdin
keywords: NOSOSCF
formula: C18H26O2
InChI: InChI=1/C18H26O2/c1-8-10-13(5)15(9-2)20-17(19)16-14(11-12(3)4)18(16,6)7/h2,10-11,14-16H,8H2,1,3-7H3
46 atoms
O  -0.979012 -0.66821 -0.313561
O  -0.081181 0.083376 1.600122
C  2.093292 1.22259 -0.364775
C  2.607202 -0.039525 0.255783
C  1.239347 -0.03616 -0.394019
C  1.741875 2.379197 0.537109
C  2.646335 1.659862 -1.698286
C  3.684855 -0.84879 -0.360391
C  0.024728 -0.180187 0.424749
C  4.916036 -1.011365 0.133271
C  5.409026 -0.36979 1.393159
C  5.922752 -1.87237 -0.567694
C  -2.277337 -0.847316 0.284678
C  -3.233933 0.163532 -0.30101
C  -2.681593 -2.22223 0.005572
C  -3.493281 0.049847 -1.771272
C  -3.779756 1.060989 0.522205
C  -4.773609 2.122829 0.179196
C  -3.041242 -3.345916 -0.216961
C  -6.172433 1.755377 0.669457
H  2.585444 -0.034278 1.341009
H  1.17938 -0.511966 -1.366627
H  2.604251 3.042086 0.622316
H  0.919553 2.965962 0.125915
H  1.47012 2.07383 1.544163
H  3.586303 2.196577 -1.560409
H  2.836614 0.824424 -2.370303
H  1.950972 2.336007 -2.197984
H  3.439874 -1.345657 -1.294968
H  6.293058 0.238291 1.18693
H  4.673717 0.272165 1.873479
H  5.720841 -1.125417 2.118023
H  6.80783 -1.294056 -0.844847
H  6.273262 -2.675434 0.08577
H  5.519098 -2.326715 -1.472216
H  -2.214323 -0.713374 1.366496
H  -2.563413 0.013283 -2.340661
H  -4.039511 -0.86735 -2.002125
H  -4.079094 0.88135 -2.155527
H  -3.515648 1.0060 1.575413
H  -4.801735 2.315609 -0.893648
H  -4.465087 3.057405 0.654611
H  -3.354927 -4.347179 -0.412892
H  -6.535759 0.853846 0.175352
H  -6.182441 1.572348 1.744778
H  -6.880547 2.55858 0.463745
elementType: O C H
totalener: -851.99855646 hartree
nucrepener: 1516.04151179 hartree
electener: -2368.04006825 hartree
oneelecener: -4165.71328917 hartree
twoeener: 1797.67322092 hartree
cpcmener: -0.02444442 hartree
kineticenergy: 847.99004361 hartree
xcener: -85.217488333849 hartree
chargesum: 0.0000000
charge: -0.296053 -0.494402 0.151180 0.016383 -0.161985 -0.294909 -0.263164 -0.281964 0.438504 -0.032892 -0.252902 -0.226700 0.201700 -0.145178 -0.546208 -0.265167 -0.077221 -0.089923 0.179400 -0.266358 0.096712 0.091293 0.096786 0.101922 0.092380 0.096100 0.090360 0.098998 0.124051 0.095789 0.089822 0.097270 0.094162 0.094662 0.089798 0.121296 0.105202 0.103246 0.101708 0.126175 0.071966 0.075355 0.287912 0.086019 0.086770 0.092102
qa: -0.2961 -0.4944 0.1512 0.0164 -0.1620 -0.2949 -0.2632 -0.2820 0.4385 -0.0329 -0.2529 -0.2267 0.2017 -0.1452 -0.5462 -0.2652 -0.0772 -0.0899 0.1794 -0.2664 0.0967 0.0913 0.0968 0.1019 0.0924 0.0961 0.0904 0.0990 0.1241 0.0958 0.0898 0.0973 0.0942 0.0947 0.0898 0.1213 0.1052 0.1032 0.1017 0.1262 0.0720 0.0754 0.2879 0.0860 0.0868 0.0921
va: 2.1136 2.0131 3.6566 3.7690 3.9164 3.9074 3.9070 3.8765 4.1460 3.7136 3.9448 3.9244 3.8043 3.7800 3.9712 3.9431 3.8056 3.9202 3.4383 3.9125 1.0259 1.0399 1.0008 0.9988 1.0180 1.0030 1.0028 1.0026 1.0071 0.9976 1.0080 0.9975 0.9965 0.9955 1.0080 1.0373 1.0075 0.9950 1.0078 1.0064 1.0110 1.0044 0.9446 1.0013 1.0016 1.0048
dispcorr: -0.019379976 hartree
energy: -852.017936438943
dipole: 6.73683 -6.62942 0.10741 10.51287 -10.15463 0.35824 -3.87902 2.89305 -0.98598
magnitude: 1.05453 au
magnitude: 2.68039 debye
