program: Orca
programVersion: 5.0.2
elementType: O O C C C C C C C C C C C C C C C C C C H H H H H H H H H H H H H H H H H H H H H H H H H H
charge: 0
multiplicity: 1
keywords: wb97x-d3
keywords: def2-TZVPP
keywords: def2/J RIJCOSX
keywords: DEFGRID2
keywords: scfconv7
keywords: smallprint printgap noloewdin
keywords: NOSOSCF
formula: C18H26O2
InChI: InChI=1/C18H26O2/c1-8-10-13(5)15(9-2)20-17(19)16-14(11-12(3)4)18(16,6)7/h2,10-11,14-16H,8H2,1,3-7H3
46 atoms
O  -0.731872 -0.916074 -0.319768
O  -0.139023 0.597239 1.221278
C  1.935152 1.446096 -0.979448
C  2.615537 0.590126 0.029621
C  1.323098 0.100765 -0.609257
C  1.296665 2.737009 -0.529868
C  2.48834 1.521664 -2.382142
C  3.892044 -0.116856 -0.240558
C  0.104903 -0.012505 0.204662
C  4.356927 -1.14499 0.474351
C  3.617199 -1.746193 1.628719
C  5.677165 -1.780097 0.163413
C  -2.01068 -1.104528 0.315727
C  -2.989165 -0.050235 -0.13373
C  -2.448673 -2.442265 -0.072325
C  -3.332554 -0.013228 -1.593545
C  -3.516332 0.77482 0.770528
C  -4.521287 1.849049 0.475183
C  -2.844176 -3.530051 -0.391161
C  -5.119783 2.454289 1.735951
H  2.482356 0.921686 1.056187
H  1.427043 -0.665486 -1.368636
H  0.992339 2.725551 0.514051
H  2.012342 3.552513 -0.649401
H  0.422161 2.977596 -1.136834
H  2.882752 0.568429 -2.732848
H  1.708318 1.830968 -3.079861
H  3.292188 2.258281 -2.4393
H  4.494605 0.25029 -1.066195
H  3.488725 -2.821076 1.482222
H  4.18578 -1.629447 2.554739
H  2.631539 -1.310795 1.784913
H  6.345089 -1.739047 1.027529
H  5.554154 -2.838413 -0.079968
H  6.179654 -1.296814 -0.674184
H  -1.898317 -1.074509 1.403185
H  -3.533551 1.00301 -1.931404
H  -2.528359 -0.408833 -2.213941
H  -4.223168 -0.608619 -1.808767
H  -3.206596 0.670553 1.807475
H  -5.319231 1.44912 -0.156464
H  -4.048427 2.63865 -0.118437
H  -3.189623 -4.499143 -0.675235
H  -5.630116 1.699452 2.335735
H  -4.349684 2.907808 2.361646
H  -5.846278 3.229377 1.492316
elementType: O C H
totalener: -851.99734907 hartree
nucrepener: 1542.62558122 hartree
electener: -2394.62293029 hartree
oneelecener: -4219.05608925 hartree
twoeener: 1824.43315896 hartree
cpcmener: -0.02437645 hartree
kineticenergy: 847.98158860 hartree
xcener: -85.214957702833 hartree
chargesum: -0.0000000
charge: -0.293026 -0.500578 0.157159 -0.042965 -0.092267 -0.276458 -0.294217 -0.281881 0.412545 -0.012167 -0.248666 -0.228800 0.167633 -0.114991 -0.523338 -0.297429 -0.110467 -0.076535 0.198175 -0.278141 0.102046 0.092251 0.091987 0.097339 0.100994 0.091927 0.098794 0.101319 0.126892 0.096567 0.101280 0.080505 0.095079 0.095795 0.089402 0.125725 0.107568 0.103112 0.113234 0.113359 0.080267 0.081341 0.286601 0.087264 0.085150 0.090617
qa: -0.2930 -0.5006 0.1572 -0.0430 -0.0923 -0.2765 -0.2942 -0.2819 0.4125 -0.0122 -0.2487 -0.2288 0.1676 -0.1150 -0.5233 -0.2974 -0.1105 -0.0765 0.1982 -0.2781 0.1020 0.0923 0.0920 0.0973 0.1010 0.0919 0.0988 0.1013 0.1269 0.0966 0.1013 0.0805 0.0951 0.0958 0.0894 0.1257 0.1076 0.1031 0.1132 0.1134 0.0803 0.0813 0.2866 0.0873 0.0851 0.0906
va: 2.1065 2.0028 3.7095 3.8392 3.8192 3.8829 3.9166 3.8811 4.1396 3.7041 3.9442 3.9279 3.8590 3.6439 3.9466 3.9473 3.8522 3.8905 3.4144 3.9584 1.0229 1.0340 1.0184 1.0008 0.9989 1.0009 1.0024 0.9986 1.0022 0.9983 0.9983 1.0146 0.9957 0.9963 1.0067 1.0229 0.9987 1.0152 0.9926 1.0116 0.9989 1.0016 0.9449 0.9987 0.9972 1.0052
dispcorr: -0.020068891 hartree
energy: -852.017417962997
dipole: 4.33685 -4.25596 0.08089 9.25603 -9.40757 -0.15154 -2.01945 1.16169 -0.85776
magnitude: 0.87480 au
magnitude: 2.22355 debye
