program: Orca
programVersion: 5.0.2
elementType: O O C C C C C C C C C C C C C C C C C C H H H H H H H H H H H H H H H H H H H H H H H H H H
charge: 0
multiplicity: 1
keywords: wb97x-d3
keywords: def2-TZVPP
keywords: def2/J RIJCOSX
keywords: DEFGRID2
keywords: scfconv7
keywords: smallprint printgap noloewdin
keywords: NOSOSCF
formula: C18H26O2
InChI: InChI=1/C18H26O2/c1-8-10-13(5)15(9-2)20-17(19)16-14(11-12(3)4)18(16,6)7/h2,10-11,14-16H,8H2,1,3-7H3
46 atoms
O  -0.936376 -0.353107 -0.259172
O  0.097171 -0.423483 1.732612
C  2.150794 1.375011 0.136228
C  2.705132 -0.004418 0.325647
C  1.312228 0.16403 -0.245681
C  1.80835 2.182411 1.363545
C  2.630262 2.226831 -1.013547
C  3.762008 -0.565574 -0.540159
C  0.131336 -0.231636 0.539197
C  4.888866 -1.159862 -0.133981
C  5.290382 -1.345504 1.297404
C  5.867598 -1.70726 -1.129205
C  -2.21653 -0.707547 0.302332
C  -3.153128 0.46306 0.100059
C  -2.623193 -1.961278 -0.320021
C  -2.727545 1.688813 0.8524
C  -4.238513 0.359999 -0.667176
C  -5.270595 1.404808 -0.942359
C  -2.952574 -3.00844 -0.805882
C  -6.669047 0.925026 -0.565008
H  2.721326 -0.329688 1.36019
H  1.210959 0.00796 -1.31408
H  1.594349 1.569277 2.235977
H  2.651456 2.826445 1.619834
H  0.946303 2.827791 1.181894
H  2.800568 1.654487 -1.924318
H  1.895151 3.000047 -1.243708
H  3.565029 2.726959 -0.753324
H  3.590632 -0.48831 -1.61009
H  4.617383 -0.872651 2.010989
H  5.34875 -2.40904 1.547592
H  6.289931 -0.936131 1.466749
H  6.028836 -2.776834 -0.970772
H  5.534514 -1.565763 -2.157272
H  6.844943 -1.229844 -1.020794
H  -2.106448 -0.881508 1.377175
H  -2.484278 1.444141 1.888902
H  -1.832974 2.140787 0.416128
H  -3.49848 2.455807 0.868596
H  -4.430973 -0.591484 -1.156037
H  -5.253778 1.631948 -2.012934
H  -5.049095 2.340756 -0.428962
H  -3.243372 -3.937196 -1.244387
H  -6.741624 0.718226 0.50338
H  -7.418731 1.6775 -0.81072
H  -6.932181 0.010197 -1.098337
elementType: O C H
totalener: -851.99913210 hartree
nucrepener: 1516.59712575 hartree
electener: -2368.59625784 hartree
oneelecener: -4166.71487678 hartree
twoeener: 1798.11861894 hartree
cpcmener: -0.02498442 hartree
kineticenergy: 847.96462902 hartree
xcener: -85.214763724921 hartree
chargesum: -0.0000000
charge: -0.285096 -0.488582 0.115509 0.041899 -0.118653 -0.278151 -0.270072 -0.289146 0.416261 -0.044885 -0.254549 -0.220175 0.111199 -0.141907 -0.535720 -0.266834 -0.068429 -0.079119 0.214444 -0.259101 0.092286 0.091267 0.092648 0.099244 0.096008 0.089685 0.098580 0.098440 0.122228 0.090820 0.098128 0.095449 0.093513 0.089356 0.094114 0.134210 0.105400 0.103336 0.107542 0.122014 0.074818 0.067198 0.285839 0.083031 0.090872 0.085079
qa: -0.2851 -0.4886 0.1155 0.0419 -0.1187 -0.2782 -0.2701 -0.2891 0.4163 -0.0449 -0.2545 -0.2202 0.1112 -0.1419 -0.5357 -0.2668 -0.0684 -0.0791 0.2144 -0.2591 0.0923 0.0913 0.0926 0.0992 0.0960 0.0897 0.0986 0.0984 0.1222 0.0908 0.0981 0.0954 0.0935 0.0894 0.0941 0.1342 0.1054 0.1033 0.1075 0.1220 0.0748 0.0672 0.2858 0.0830 0.0909 0.0851
va: 2.0921 2.0185 3.6750 3.7783 3.8527 3.9042 3.9076 3.8752 4.1655 3.7506 3.9427 3.9204 3.8626 3.7853 4.0781 3.9387 3.7476 3.9250 3.4111 3.9094 1.0320 1.0385 1.0174 1.0012 1.0014 1.0053 1.0016 1.0017 1.0096 1.0089 0.9963 0.9974 0.9957 1.0086 0.9965 1.0187 1.0021 0.9996 1.0062 1.0115 1.0037 1.0146 0.9462 1.0039 1.0048 1.0032
dispcorr: -0.019575055 hartree
energy: -852.018707150772
dipole: 6.07947 -6.02770 0.05176 10.33393 -9.67275 0.66118 -1.60643 0.76957 -0.83686
magnitude: 1.06779 au
magnitude: 2.71411 debye
