program: Orca
programVersion: 5.0.2
elementType: O O C C C C C C C C C C C C C C C C C C H H H H H H H H H H H H H H H H H H H H H H H H H H
charge: 0
multiplicity: 1
keywords: wb97x-d3
keywords: def2-TZVPP
keywords: def2/J RIJCOSX
keywords: DEFGRID2
keywords: scfconv7
keywords: smallprint printgap noloewdin
keywords: NOSOSCF
formula: C18H26O2
InChI: InChI=1/C18H26O2/c1-8-10-13(5)15(9-2)20-17(19)16-14(11-12(3)4)18(16,6)7/h2,10-11,14-16H,8H2,1,3-7H3
46 atoms
O  -0.905142 0.060248 0.334121
O  0.305276 -0.627629 2.083863
C  2.247983 1.60931 0.87116
C  2.784047 0.234022 0.672101
C  1.356386 0.530871 0.266935
C  2.003814 2.101885 2.275054
C  2.658532 2.703933 -0.083483
C  3.800816 -0.078172 -0.365436
C  0.241222 -0.072294 1.011284
C  3.841576 -1.203221 -1.083589
C  2.839924 -2.307651 -0.948521
C  4.916625 -1.442487 -2.09872
C  -2.086225 -0.508478 0.888478
C  -3.31312 0.117297 0.254247
C  -2.070401 -1.95773 0.677138
C  -4.579548 -0.299795 0.937325
C  -3.222387 0.948727 -0.782999
C  -4.344614 1.63313 -1.496265
C  -2.080342 -3.142639 0.481069
C  -4.498495 1.106034 -2.92067
H  2.864565 -0.349577 1.586565
H  1.169592 0.646128 -0.794843
H  1.75892 1.30368 2.972961
H  2.902273 2.596089 2.64963
H  1.193677 2.833294 2.29824
H  3.600915 3.155649 0.232527
H  2.787327 2.343213 -1.103941
H  1.905709 3.493795 -0.104835
H  4.579654 0.663558 -0.520881
H  3.339597 -3.245895 -0.694372
H  2.083307 -2.118415 -0.189315
H  2.328089 -2.482045 -1.898581
H  4.486763 -1.601517 -3.090971
H  5.615126 -0.608486 -2.162098
H  5.486303 -2.344677 -1.862181
H  -2.124899 -0.313043 1.966305
H  -4.53644 -0.074264 2.005482
H  -5.45774 0.193814 0.52946
H  -4.740979 -1.376668 0.850521
H  -2.243396 1.162749 -1.198354
H  -4.126715 2.704145 -1.537875
H  -5.290141 1.533045 -0.963213
H  -2.077766 -4.195632 0.306099
H  -4.771009 0.050044 -2.921765
H  -5.274754 1.65217 -3.457827
H  -3.570318 1.209683 -3.484933
elementType: O C H
totalener: -851.99684097 hartree
nucrepener: 1545.59320231 hartree
electener: -2397.59004327 hartree
oneelecener: -4224.82276089 hartree
twoeener: 1827.23271762 hartree
cpcmener: -0.02507056 hartree
kineticenergy: 847.98281165 hartree
xcener: -85.219094847104 hartree
chargesum: 0.0000000
charge: -0.280891 -0.493790 0.150638 -0.012720 -0.124203 -0.276711 -0.285836 -0.296162 0.417541 -0.019446 -0.236626 -0.229231 0.204557 -0.094961 -0.511373 -0.252570 -0.155485 -0.080735 0.117996 -0.264653 0.101914 0.098699 0.089971 0.098158 0.100275 0.100540 0.094116 0.098467 0.124464 0.102109 0.077461 0.098644 0.095395 0.090385 0.096190 0.129565 0.104917 0.099480 0.103581 0.129814 0.073726 0.069067 0.286909 0.084184 0.091050 0.085578
qa: -0.2809 -0.4938 0.1506 -0.0127 -0.1242 -0.2767 -0.2858 -0.2962 0.4175 -0.0194 -0.2366 -0.2292 0.2046 -0.0950 -0.5114 -0.2526 -0.1555 -0.0807 0.1180 -0.2647 0.1019 0.0987 0.0900 0.0982 0.1003 0.1005 0.0941 0.0985 0.1245 0.1021 0.0775 0.0986 0.0954 0.0904 0.0962 0.1296 0.1049 0.0995 0.1036 0.1298 0.0737 0.0691 0.2869 0.0842 0.0911 0.0856
va: 2.1263 2.0027 3.7061 3.8158 3.8295 3.8977 3.9067 3.8857 4.1158 3.7120 3.9367 3.9288 3.8108 3.8414 3.7804 3.9440 3.8240 3.9151 3.5977 3.9092 1.0276 1.0260 1.0162 1.0007 0.9996 0.9996 1.0017 1.0029 1.0031 0.9996 1.0150 0.9990 0.9965 1.0061 0.9961 1.0149 0.9988 1.0074 0.9975 1.0200 1.0040 1.0134 0.9466 1.0033 1.0048 1.0022
dispcorr: -0.020016421 hartree
energy: -852.016857387176
dipole: 1.91691 -2.15152 -0.23461 6.62437 -5.99729 0.62708 -10.84639 9.80508 -1.04131
magnitude: 1.23798 au
magnitude: 3.14671 debye
