program: Orca
programVersion: 5.0.2
elementType: O O C C C C C C C C C C C C C C C C C C H H H H H H H H H H H H H H H H H H H H H H H H H H
charge: 0
multiplicity: 1
keywords: wb97x-d3
keywords: def2-TZVPP
keywords: def2/J RIJCOSX
keywords: DEFGRID2
keywords: scfconv7
keywords: smallprint printgap noloewdin
keywords: NOSOSCF
formula: C18H26O2
InChI: InChI=1/C18H26O2/c1-8-10-13(5)15(9-2)20-17(19)16-14(11-12(3)4)18(16,6)7/h2,10-11,14-16H,8H2,1,3-7H3
46 atoms
O  -0.962725 -0.408294 -0.26924
O  0.09067 -0.530436 1.709297
C  2.133311 1.263133 0.079696
C  2.689294 -0.110818 0.306291
C  1.302542 0.037874 -0.275728
C  1.777378 2.102491 1.281009
C  2.63087 2.079322 -1.087768
C  3.760178 -0.679843 -0.54103
C  0.118219 -0.333501 0.5167
C  4.963422 -1.08049 -0.119236
C  5.433141 -0.999937 1.301033
C  5.96275 -1.65591 -1.077046
C  -2.248423 -0.708078 0.310453
C  -3.153044 0.480249 0.070206
C  -2.692567 -1.972026 -0.263516
C  -2.649274 1.738216 0.713871
C  -4.282941 0.365356 -0.627622
C  -5.296322 1.426561 -0.909371
C  -3.052581 -3.024632 -0.714329
C  -6.663914 1.058799 -0.339789
H  2.705175 -0.411658 1.348632
H  1.203161 -0.144118 -1.340435
H  1.535681 1.511826 2.161925
H  2.623464 2.740892 1.54184
H  0.928312 2.755003 1.066135
H  2.813962 1.476615 -1.976439
H  1.903036 2.8479 -1.353791
H  3.564305 2.583229 -0.829002
H  3.535189 -0.774541 -1.599667
H  4.725761 -0.513678 1.97018
H  5.639234 -1.99752 1.697968
H  6.374423 -0.447488 1.358331
H  5.572076 -1.719612 -2.092457
H  6.874113 -1.053009 -1.102255
H  6.266803 -2.659701 -0.76888
H  -2.13624 -0.843517 1.390699
H  -1.803022 2.160806 0.166859
H  -3.413883 2.509796 0.770594
H  -2.302673 1.543709 1.731315
H  -4.535075 -0.60868 -1.038302
H  -5.385381 1.538404 -1.994165
H  -4.985014 2.3986 -0.526632
H  -3.371274 -3.959311 -1.119594
H  -7.409726 1.810868 -0.598579
H  -7.011603 0.100818 -0.729389
H  -6.63077 0.982131 0.747576
elementType: O C H
totalener: -851.99889240 hartree
nucrepener: 1517.74887049 hartree
electener: -2369.74776289 hartree
oneelecener: -4168.99379808 hartree
twoeener: 1799.24603519 hartree
cpcmener: -0.02482888 hartree
kineticenergy: 847.97133677 hartree
xcener: -85.215786521691 hartree
chargesum: -0.0000000
charge: -0.285370 -0.487124 0.135432 0.030219 -0.134552 -0.283663 -0.265282 -0.293239 0.416446 -0.033451 -0.254850 -0.224022 0.115914 -0.140799 -0.541275 -0.277885 -0.067358 -0.077926 0.217804 -0.259889 0.093471 0.092964 0.093203 0.099611 0.096095 0.089992 0.098548 0.097980 0.123355 0.090451 0.098427 0.095312 0.089365 0.094647 0.093611 0.135333 0.104497 0.109357 0.106105 0.123355 0.075048 0.065688 0.285173 0.090850 0.084600 0.083831
qa: -0.2854 -0.4871 0.1354 0.0302 -0.1346 -0.2837 -0.2653 -0.2932 0.4164 -0.0335 -0.2548 -0.2240 0.1159 -0.1408 -0.5413 -0.2779 -0.0674 -0.0779 0.2178 -0.2599 0.0935 0.0930 0.0932 0.0996 0.0961 0.0900 0.0985 0.0980 0.1234 0.0905 0.0984 0.0953 0.0894 0.0946 0.0936 0.1353 0.1045 0.1094 0.1061 0.1234 0.0750 0.0657 0.2852 0.0909 0.0846 0.0838
va: 2.0936 2.0207 3.6686 3.7782 3.8766 3.9029 3.9042 3.8780 4.1677 3.7278 3.9443 3.9229 3.8534 3.7670 4.0908 3.9419 3.7488 3.9253 3.4113 3.9075 1.0308 1.0388 1.0171 1.0017 1.0015 1.0042 1.0023 1.0024 1.0080 1.0081 0.9967 0.9975 1.0085 0.9964 0.9954 1.0189 0.9992 1.0050 1.0028 1.0108 1.0040 1.0138 0.9467 1.0049 1.0032 1.0037
dispcorr: -0.019818844 hartree
energy: -852.018711242756
dipole: 6.62315 -6.54903 0.07411 11.37237 -10.63292 0.73945 -1.50630 0.67858 -0.82772
magnitude: 1.11238 au
magnitude: 2.82746 debye
