program: Orca
programVersion: 5.0.2
elementType: O O C C C C C C C C C C C C C C C C C C H H H H H H H H H H H H H H H H H H H H H H H H H H
charge: 0
multiplicity: 1
keywords: wb97x-d3
keywords: def2-TZVPP
keywords: def2/J RIJCOSX
keywords: DEFGRID2
keywords: scfconv7
keywords: smallprint printgap noloewdin
keywords: NOSOSCF
formula: C18H26O2
InChI: InChI=1/C18H26O2/c1-8-10-13(5)15(9-2)20-17(19)16-14(11-12(3)4)18(16,6)7/h2,10-11,14-16H,8H2,1,3-7H3
46 atoms
O  -1.02457 -1.109002 -0.387719
O  -0.140498 -0.459601 1.56234
C  1.652575 1.177863 -0.489175
C  2.44615 0.097854 0.185314
C  1.124369 -0.249598 -0.461475
C  1.012065 2.241286 0.368456
C  2.087233 1.69241 -1.839143
C  3.686799 -0.455108 -0.396043
C  -0.03927 -0.602266 0.366622
C  4.866004 -0.580743 0.220966
C  5.142561 -0.158066 1.630927
C  6.044981 -1.171741 -0.492364
C  -2.258315 -1.400573 0.265445
C  -3.071398 -0.15941 0.598212
C  -3.005509 -2.273264 -0.636027
C  -4.083019 -0.405968 1.672426
C  -2.866029 0.988779 -0.044212
C  -3.581961 2.284875 0.163857
C  -3.649234 -2.986914 -1.35559
C  -4.425442 2.66145 -1.051579
H  2.413045 0.142421 1.268696
H  1.170816 -0.765693 -1.414322
H  1.677677 3.103697 0.435796
H  0.072833 2.586775 -0.069655
H  0.809814 1.910856 1.385097
H  2.865316 2.4498 -1.724818
H  2.47848 0.909076 -2.486677
H  1.247162 2.158645 -2.356881
H  3.619969 -0.790853 -1.426915
H  5.92775 0.60207 1.650166
H  4.276778 0.251287 2.147316
H  5.516964 -0.999204 2.219156
H  5.804826 -1.465641 -1.513715
H  6.875823 -0.462677 -0.5313
H  6.41846 -2.053702 0.034004
H  -2.064301 -1.953237 1.192053
H  -4.743475 0.442113 1.834144
H  -4.709528 -1.267485 1.429287
H  -3.590229 -0.635724 2.62034
H  -2.110528 1.021645 -0.824688
H  -2.836412 3.067526 0.332736
H  -4.210335 2.262138 1.054173
H  -4.205936 -3.617349 -2.013194
H  -3.817556 2.715262 -1.955865
H  -5.213613 1.927987 -1.22494
H  -4.898486 3.634126 -0.91336
elementType: O C H
totalener: -851.99900017 hartree
nucrepener: 1547.57476728 hartree
electener: -2399.57376745 hartree
oneelecener: -4228.73254783 hartree
twoeener: 1829.15878038 hartree
cpcmener: -0.02638968 hartree
kineticenergy: 847.97767525 hartree
xcener: -85.218233716901 hartree
chargesum: -0.0000000
charge: -0.293334 -0.480240 0.116261 0.036652 -0.092194 -0.275193 -0.270069 -0.288697 0.377037 -0.047475 -0.253038 -0.219255 0.187660 -0.090811 -0.579354 -0.251460 -0.156815 -0.082467 0.236723 -0.266314 0.092909 0.093030 0.102255 0.093214 0.094997 0.098484 0.090030 0.098287 0.122413 0.097251 0.090121 0.096235 0.088824 0.093340 0.094228 0.126767 0.096981 0.102421 0.104537 0.126093 0.072576 0.069513 0.285517 0.086063 0.084706 0.091591
qa: -0.2933 -0.4802 0.1163 0.0367 -0.0922 -0.2752 -0.2701 -0.2887 0.3770 -0.0475 -0.2530 -0.2193 0.1877 -0.0908 -0.5794 -0.2515 -0.1568 -0.0825 0.2367 -0.2663 0.0929 0.0930 0.1023 0.0932 0.0950 0.0985 0.0900 0.0983 0.1224 0.0973 0.0901 0.0962 0.0888 0.0933 0.0942 0.1268 0.0970 0.1024 0.1045 0.1261 0.0726 0.0695 0.2855 0.0861 0.0847 0.0916
va: 2.1095 2.0193 3.6796 3.7917 3.8310 3.8964 3.9046 3.8691 4.1987 3.7548 3.9414 3.9200 3.8226 3.7370 4.0583 3.9503 3.8369 3.9111 3.3698 3.9092 1.0326 1.0377 1.0025 1.0015 1.0164 1.0019 1.0050 1.0023 1.0092 0.9969 1.0097 0.9968 1.0085 0.9963 0.9960 1.0125 1.0071 0.9963 0.9983 1.0135 1.0070 1.0119 0.9460 1.0018 1.0023 1.0052
dispcorr: -0.020582288 hartree
energy: -852.019582458056
dipole: 7.93003 -7.77848 0.15155 14.33562 -13.88299 0.45263 -0.99664 0.30075 -0.69589
magnitude: 0.84386 au
magnitude: 2.14493 debye
