program: Orca
programVersion: 5.0.2
elementType: O O C C C C C C C C C C C C C C C C C C H H H H H H H H H H H H H H H H H H H H H H H H H H
charge: 0
multiplicity: 1
keywords: wb97x-d3
keywords: def2-TZVPP
keywords: def2/J RIJCOSX
keywords: DEFGRID2
keywords: scfconv7
keywords: smallprint printgap noloewdin
keywords: NOSOSCF
formula: C18H26O2
InChI: InChI=1/C18H26O2/c1-8-10-13(5)15(9-2)20-17(19)16-14(11-12(3)4)18(16,6)7/h2,10-11,14-16H,8H2,1,3-7H3
46 atoms
O  -0.909038 -0.906552 -0.384305
O  -0.190753 0.421936 1.268277
C  1.986817 1.238062 -0.82784
C  2.569157 0.197449 0.077009
C  1.231489 -0.060545 -0.598251
C  1.499191 2.530282 -0.219251
C  2.557934 1.428463 -2.212667
C  3.717318 -0.647132 -0.308781
C  0.002841 -0.127472 0.208154
C  4.778452 -0.94451 0.448583
C  4.997083 -0.448398 1.845322
C  5.85925 -1.84574 -0.069673
C  -2.20109 -1.03559 0.240926
C  -3.09652 0.115479 -0.156641
C  -2.724837 -2.323663 -0.203576
C  -3.408741 0.22611 -1.617083
C  -3.535667 0.931903 0.803175
C  -4.442556 2.109636 0.659925
C  -3.18465 -3.373332 -0.56148
C  -5.783242 1.870367 1.350255
H  2.491669 0.437747 1.131982
H  1.254499 -0.750118 -1.434586
H  1.229413 2.440876 0.829979
H  2.288729 3.280849 -0.286798
H  0.634051 2.916947 -0.761241
H  3.449174 2.05772 -2.170469
H  2.834335 0.491834 -2.694298
H  1.831968 1.927594 -2.856846
H  3.675384 -1.076533 -1.305522
H  4.909411 -1.266654 2.562955
H  6.008314 -0.052972 1.955005
H  4.304949 0.332621 2.148613
H  5.999621 -2.706446 0.589343
H  5.640554 -2.219844 -1.069676
H  6.820151 -1.326181 -0.105243
H  -2.088998 -1.064573 1.328213
H  -4.012122 -0.619399 -1.954721
H  -3.957451 1.133464 -1.856619
H  -2.500312 0.22541 -2.221494
H  -3.230687 0.718031 1.824793
H  -4.609339 2.364851 -0.386563
H  -3.959761 2.977631 1.117869
H  -3.604746 -4.307812 -0.860626
H  -6.417331 2.754859 1.284931
H  -6.32011 1.040026 0.890495
H  -5.650347 1.635554 2.407299
elementType: O C H
totalener: -851.99989320 hartree
nucrepener: 1525.97132653 hartree
electener: -2377.97121973 hartree
oneelecener: -4185.70558078 hartree
twoeener: 1807.73436104 hartree
cpcmener: -0.02546922 hartree
kineticenergy: 847.98638740 hartree
xcener: -85.218145930876 hartree
chargesum: 0.0000000
charge: -0.292497 -0.496924 0.109629 0.048780 -0.112178 -0.281623 -0.271236 -0.291491 0.422466 -0.042552 -0.259149 -0.219315 0.177380 -0.156356 -0.534388 -0.260353 -0.080722 -0.085858 0.195900 -0.265960 0.093037 0.089956 0.092358 0.097399 0.100658 0.097518 0.089934 0.098063 0.121129 0.100986 0.093906 0.091967 0.093266 0.088992 0.094806 0.126402 0.103390 0.101997 0.103634 0.122513 0.070219 0.074076 0.286724 0.091540 0.085380 0.086598
qa: -0.2925 -0.4969 0.1096 0.0488 -0.1122 -0.2816 -0.2712 -0.2915 0.4225 -0.0426 -0.2591 -0.2193 0.1774 -0.1564 -0.5344 -0.2604 -0.0807 -0.0859 0.1959 -0.2660 0.0930 0.0900 0.0924 0.0974 0.1007 0.0975 0.0899 0.0981 0.1211 0.1010 0.0939 0.0920 0.0933 0.0890 0.0948 0.1264 0.1034 0.1020 0.1036 0.1225 0.0702 0.0741 0.2867 0.0915 0.0854 0.0866
va: 2.1192 2.0099 3.6793 3.7741 3.8589 3.9029 3.9104 3.8831 4.1470 3.7461 3.9431 3.9209 3.8408 3.7532 3.9575 3.9400 3.8198 3.9217 3.4276 3.9122 1.0303 1.0386 1.0188 1.0003 0.9987 1.0016 1.0060 1.0017 1.0103 0.9954 0.9980 1.0084 0.9954 1.0090 0.9962 1.0217 0.9961 1.0085 1.0065 1.0112 1.0144 1.0045 0.9451 1.0048 1.0024 1.0021
dispcorr: -0.019456140 hartree
energy: -852.019349344497
dipole: 6.62788 -6.47909 0.14879 10.47869 -10.38135 0.09735 -1.63130 0.84511 -0.78619
magnitude: 0.80604 au
magnitude: 2.04880 debye
