program: Orca
programVersion: 5.0.2
elementType: Cl Cl O O N C C C C C C C C C C C C C C H H H H H H H H H H H H H H H H H
charge: 0
multiplicity: 1
keywords: wb97x-d3
keywords: def2-TZVPP
keywords: def2/J RIJCOSX
keywords: DEFGRID2
keywords: scfconv7
keywords: smallprint printgap noloewdin
keywords: NOSOSCF
formula: C14H17Cl2NO2
InChI: InChI=1/C14H17Cl2NO2/c1-14(7-3-2-4-8-14)13(19)17-9-5-6-10(18)12(16)11(9)15/h5-6,17-18H,2-4,7-8H2,1H3
36 atoms
Cl -1.429078 -1.90432 -0.849812
Cl -4.373764 -0.947337 -1.024351
O  1.577631 1.769139 1.235715
O  -4.797059 1.822871 -0.004593
N  0.464627 0.044137 0.26882
C  2.865346 -0.179125 0.60571
C  3.192934 -0.301022 -0.89866
C  4.014665 0.555514 1.313541
C  4.555283 -0.935767 -1.159338
C  5.37927 -0.074634 1.051378
C  5.666866 -0.181466 -0.440876
C  2.650632 -1.561107 1.241259
C  1.586267 0.659552 0.753409
C  -0.844587 0.516286 0.221339
C  -1.837593 -0.318972 -0.297865
C  -1.237311 1.782381 0.661255
C  -3.160822 0.098941 -0.380551
C  -2.552172 2.191044 0.577874
C  -3.538226 1.365495 0.055279
H  3.179539 0.700066 -1.342855
H  2.418593 -0.873527 -1.41829
H  3.818653 0.598529 2.387546
H  4.037468 1.592324 0.971451
H  4.741425 -0.951209 -2.235643
H  4.550782 -1.982409 -0.839901
H  5.445592 -1.065844 1.510607
H  6.146922 0.528992 1.540507
H  6.628436 -0.67091 -0.611126
H  5.751657 0.824799 -0.864866
H  3.579943 -2.126874 1.2802
H  2.284421 -1.471688 2.264956
H  1.941354 -2.183822 0.691236
H  0.593736 -0.878694 -0.110694
H  -0.501464 2.451985 1.072338
H  -2.830608 3.177061 0.924379
H  -5.378784 1.156799 -0.386678
totalener: -1669.46064228 hartree
nucrepener: 1715.04121138 hartree
electener: -3384.50185366 hartree
oneelecener: -5697.96790625 hartree
twoeener: 2313.46605258 hartree
kineticenergy: 1664.83877578 hartree
xcener: -115.368532837018 hartree
chargesum: -0.0000000
charge: -0.073618 -0.073764 -0.396134 -0.287999 -0.173839 0.282729 -0.246612 -0.198070 -0.155650 -0.156814 -0.114678 -0.352812 0.249515 0.177910 -0.088005 -0.171878 0.066857 -0.119859 0.147024 0.100273 0.075750 0.085175 0.094782 0.079243 0.071030 0.067558 0.077752 0.075578 0.066688 0.092053 0.111616 0.082394 0.133201 0.157746 0.123026 0.191831
qa: -0.0736 -0.0738 -0.3961 -0.2880 -0.1738 0.2827 -0.2466 -0.1981 -0.1557 -0.1568 -0.1147 -0.3528 0.2495 0.1779 -0.0880 -0.1719 0.0669 -0.1199 0.1470 0.1003 0.0757 0.0852 0.0948 0.0792 0.0710 0.0676 0.0778 0.0756 0.0667 0.0921 0.1116 0.0824 0.1332 0.1577 0.1230 0.1918
va: 1.2722 1.2687 2.1111 2.1998 3.2361 3.7076 3.9407 3.9429 3.8985 3.8971 3.8633 3.9876 4.1012 3.8340 3.9619 4.0171 3.8043 3.9555 4.0906 1.0119 1.0227 1.0216 1.0254 1.0135 1.0069 1.0089 1.0148 1.0140 1.0128 1.0029 1.0059 1.0128 1.0743 1.0365 1.0118 1.0695
dispcorr: -0.017765752 hartree
energy: -1669.478408036768
dipole: 51.40880 -51.03798 0.37082 2.81214 -3.63803 -0.82588 7.00044 -7.36583 -0.36538
magnitude: 0.97627 au
magnitude: 2.48147 debye
