program: Gaussian 09
title: 000072315
version: EM64L-G09RevD.01
frameworkgroup: C1[X(C21H24N2O2)]
method: RPBEPBE
basis: SDD
operation: Freq
keyword: #p
keyword: freq=noraman
keyword: PBEPBE/SDD
title: #p freq=noraman PBEPBE/SDD
converged: YES YES NO NO
title: Mulliken charges:
elementType: O O N N C C C C C C C C C C C C C C C C C C C C C H H H H H H H H H H H H H H H H H H H H H H H H
charge: -0.267106 -0.257909 -0.097880 -0.479304 0.192924 -0.457001 -0.193343 -0.553307 -0.385789 0.612624 0.193962 -0.475366 -0.362551 0.189746 -0.595659 0.147631 -0.599484 0.141645 0.178732 -0.678519 -0.433071 -0.370415 -0.260607 -0.506366 -0.224520 0.274903 0.225034 0.233078 0.262678 0.211822 0.190478 0.247533 0.194271 0.209622 0.226281 0.222773 0.223815 0.209257 0.333977 0.212593 0.220239 0.224778 0.226027 0.232369 0.218005 0.244794 0.232744 0.244361 0.219500
chargesum: 0.00000
title: Mulliken charges with hydrogens summed into heavy atoms:
elementType: O O N N C C C C C C C C C C C C C C C C C C C C C
charge: -0.267106 -0.257909 -0.097880 -0.145327 0.192924 -0.182098 0.031691 -0.057551 0.016511 0.612624 0.193962 -0.227833 0.041341 0.189746 -0.146604 0.147631 -0.166412 0.141645 0.178732 -0.020909 -0.207045 -0.138046 -0.042602 0.215534 -0.005020
polarizability: 3.12677523e+02 3.58477620e+00 2.15120651e+02 5.32739077e+00 1.77509748e+01 1.97894193e+02
1716.lowfreq: -9.8297 0.0000 0.0003 0.0005 1.2958 8.3041 27.0146 40.0585 51.6635
frequency: 26.7358 40.0222 51.4987 62.8286 69.0046 88.7195 102.7774 116.3569 134.2321 144.1138 169.8437 192.5799 207.3968 221.8724 230.6784 239.8587 257.6220 260.6257 291.7133 320.6017 328.7061 356.5209 370.5370 399.3597 410.1716 432.4736 457.9051 479.9745 501.9412 513.1595 530.9622 548.6635 572.2507 587.8821 600.2916 609.7190 646.5762 686.9945 693.4827 715.9228 717.8013 748.7452 760.0333 765.9043 782.8962 787.2550 819.4224 830.2813 837.3148 849.5081 860.3403 879.4072 905.1161 922.4349 929.2070 943.1394 948.0757 964.9860 967.7891 976.8767 992.5623 1000.8641 1012.4010 1016.5407 1041.8777 1053.0699 1063.3946 1072.0936 1086.1545 1110.3219 1113.1042 1121.0244 1145.7884 1148.2104 1151.4476 1161.4191 1168.0880 1179.3868 1198.3639 1206.4169 1215.8274 1229.4290 1235.9458 1239.0332 1247.0716 1252.9647 1271.3564 1296.7442 1299.5265 1303.0154 1313.4715 1320.1859 1322.9415 1344.1649 1352.5263 1353.6388 1379.1466 1387.2084 1408.5998 1420.4765 1429.8470 1452.5176 1460.7293 1462.8791 1464.5324 1471.9283 1474.6366 1478.2243 1482.1044 1482.9468 1488.5933 1503.5953 1566.7665 1584.9473 1600.0079 1631.6985 1667.2905 2897.9773 2911.9121 2944.1046 2964.0749 2974.9628 2979.7087 2980.5200 3002.9974 3006.4297 3028.3491 3029.1310 3046.7482 3073.5104 3074.8922 3084.7752 3095.9989 3110.0581 3119.8457 3127.9354 3136.1099 3141.8181 3150.3103 3160.3173 3568.5550
redmass: 5.0063 4.3777 2.5422 4.0138 3.6859 3.4999 1.1966 2.9776 3.2344 3.6358 1.8194 4.5922 2.8570 1.9110 3.7880 3.4505 4.2627 2.9785 3.4281 4.5400 5.2862 2.5921 2.4947 3.5326 3.7410 3.7300 3.7494 3.7267 3.8830 4.3014 3.5721 5.6482 3.4710 1.6543 2.3977 2.8175 5.7945 5.2586 4.1436 5.9686 4.1853 1.4195 3.7201 3.2425 1.5139 2.8872 3.1963 2.4175 1.8724 1.4791 2.9772 3.5730 3.2756 2.3545 1.3965 2.6878 3.1601 2.8614 1.3006 2.3180 2.2988 2.6496 1.9973 3.0548 2.1469 2.1431 2.4890 1.8531 1.9691 1.7991 1.2902 2.3922 1.8960 1.8214 1.7567 2.2748 1.1636 1.3618 2.0256 1.5427 1.5476 2.1786 1.3289 1.4861 1.5325 1.3442 1.3856 3.8576 1.5586 1.3832 1.4644 1.4632 1.5087 1.7127 1.9676 1.7102 1.4416 1.2051 4.9881 1.1907 2.4373 1.0505 1.0668 3.7647 1.0777 1.0433 1.1224 1.1501 2.6972 1.0688 1.0925 1.0904 7.7153 6.2186 9.0617 7.0726 7.0167 1.0608 1.0673 1.1003 1.0807 1.0572 1.0770 1.0370 1.0619 1.0292 1.0961 1.1008 1.0871 1.1021 1.0998 1.1008 1.0875 1.1047 1.0848 1.0887 1.0954 1.0950 1.1051 1.1001 1.0807
irintensity: 1.4120 1.1533 0.0271 0.1643 0.8175 0.3001 0.9348 1.4335 0.8004 1.3160 0.0973 5.7199 1.7217 0.2167 1.0192 15.5340 0.6381 3.1098 4.5732 0.9455 13.6375 3.1700 0.2248 5.7933 1.7188 3.1600 6.3412 9.2927 0.7244 4.7412 0.9831 2.8389 4.0445 39.5490 18.2048 13.5097 7.9997 8.7278 2.7773 7.6472 13.4300 87.8676 10.1729 7.3028 9.9790 11.2169 8.9968 4.2907 16.7904 0.1003 6.8284 8.4358 4.8193 3.9269 2.2470 2.2445 1.9596 7.6286 0.0047 3.6992 17.7689 14.4176 8.9451 10.6030 12.4836 9.9195 38.0659 13.2774 6.8021 4.4551 1.0172 103.7062 5.4770 93.0210 26.0943 78.6018 0.5713 14.9699 18.7786 10.1519 24.7662 4.2886 2.7245 25.8212 5.1855 25.3569 12.2641 18.7801 3.4231 1.2620 2.1632 3.8341 4.9012 14.1156 13.7952 22.0455 3.0267 13.1089 45.8431 18.5588 14.1844 13.4220 7.2683 29.8069 6.7412 9.6807 8.2524 25.4301 6.8920 11.4325 0.7278 4.0871 4.6925 7.5849 132.1206 7.3905 3.6140 77.3614 149.6991 91.9301 13.2204 33.3845 50.5110 49.8536 24.6321 34.4158 38.6218 12.3696 55.0359 10.5705 67.1430 36.2285 11.0954 22.4011 2.4661 2.5799 27.8352 35.6370 12.4834 39.5609 66.6370
temp: 298.150 k
press: 1.00000 atm
elementType: 8 8 7 7 6 6 6 6 6 6 6 6 6 6 6 6 6 6 6 6 6 6 6 6 6 1 1 1 1 1 1 1 1 1 1 1 1 1 1 1 1 1 1 1 1 1 1 1 1
symmnumber: 1
zpe: 1067183.8 jmol-1
zpe.correction: 0.406469 hartree
zpe.thermalcorrener: 0.428589 hartree
zpe.thermalcorrenthalpy: 0.429533 hartree
zpe.thermalcorrgfe: 0.355529 hartree
zpe.sumelectzpe: -1072.743379 hartree
zpe.sumelectthermal: -1072.721259 hartree
zpe.sumelectthermalent: -1072.720315 hartree
zpe.sumelectthermalfe: -1072.794319 hartree
dipole: 1.6280 0.5217 -0.6237
dipole: 1.8198
quadrupole: -145.7557 -141.7514 -141.9813
quadrupole: 2.0032 -2.1242 -3.7638
quadrupole: -2.5929 1.4114 1.1815 2.0032 -2.1242 -3.7638
hfenergy: -1073.1498483 hartree
pointgroup: C01 [X(C21H24N2O2)]
dipole: -0.6280214 -0.2314934 -0.2541257 debye
polarizability: 312.5318023|6.8996508|214.4630363|-2.2739523|-18.1949974|198.6975285 unknown
InChI: InChI=1S/C21H24N2O2/c1-3-14-10-13-11-21(20(24)25-2)18-16(8-9-23(12-13)19(14)21)15-6-4-5-7-17(15)22-18/h4-7,10,13,19,22H,3,8-9,11-12H2,1-2H3
charge 0 multiplicity 1
49 atoms
O  -1.270474 -2.214584 -1.100889
O  -0.659322 -2.915526 1.025625
N  -1.454183 1.857973 0.041037
N  1.730623 -0.94212 0.849705
C  -0.734932 -0.480013 0.527955
C  -1.684105 0.448809 -0.34603
C  -2.270114 0.822452 2.113987
C  -1.092361 -0.200326 2.042542
C  -1.781944 2.147595 1.453345
C  -3.137358 0.085318 -0.02373
C  0.725492 -0.167312 0.232631
C  -3.43115 0.280521 1.291081
C  -0.426336 2.676891 -0.627774
C  1.328828 0.808523 -0.572843
C  0.63736 1.859866 -1.410521
C  -0.900396 -1.980719 0.220051
C  -4.091085 -0.372784 -1.102581
C  2.76514 0.626402 -0.440806
C  2.987162 -0.482134 0.453297
C  -4.393318 0.73441 -2.148827
C  3.889162 1.292268 -0.99775
C  4.281153 -0.933289 0.792857
C  5.183225 0.848951 -0.661062
C  -1.339791 -3.640689 -1.507052
C  5.377748 -0.25294 0.224318
H  -1.462281 0.308733 -1.413515
H  -2.548175 1.006404 3.166144
H  -0.210805 0.214797 2.564835
H  -1.37029 -1.141476 2.546315
H  -2.565015 2.931275 1.542874
H  -0.880797 2.513075 1.998814
H  -4.418048 0.094277 1.728971
H  0.10058 3.27018 0.149214
H  -0.886273 3.408012 -1.330329
H  1.386613 2.576357 -1.798535
H  0.16866 1.407932 -2.307806
H  -3.657637 -1.247193 -1.627573
H  -5.040558 -0.70581 -0.639991
H  1.536608 -1.750098 1.442362
H  -5.05622 0.348874 -2.945322
H  -3.465015 1.098708 -2.625253
H  -4.885935 1.600723 -1.672851
H  3.757008 2.137823 -1.682834
H  4.434304 -1.778769 1.472869
H  6.058298 1.35427 -1.085018
H  -0.351479 -4.115331 -1.388984
H  -1.645062 -3.616392 -2.562362
H  -2.077477 -4.177466 -0.887722
H  6.396972 -0.57485 0.466028
