program: Orca
programVersion: 5.0.2
elementType: O O O N C C C C C C C C C C C C C C C C C C C C C C H H H H H H H H H H H H H H H H H H H H H H H
charge: 0
multiplicity: 1
keywords: wb97x-d3
keywords: def2-TZVPP
keywords: def2/J RIJCOSX
keywords: DEFGRID2
keywords: scfconv7
keywords: smallprint printgap noloewdin
keywords: NOSOSCF
formula: C22H23NO3
InChI: InChI=1/C22H23NO3/c1-21(2)19(22(21,3)4)20(24)26-18(14-23)15-9-8-12-17(13-15)25-16-10-6-5-7-11-16/h5-13,18-19H,1-4H3
49 atoms
O  -0.0182 1.893193 0.317506
O  1.124493 1.822633 -1.611528
O  -2.639689 -2.353518 0.582835
N  -1.964914 4.588187 0.574547
C  3.127928 0.06492 0.073819
C  3.654332 1.45664 0.226905
C  2.172188 1.192722 0.464236
C  3.041412 -0.57967 -1.291319
C  3.378904 -0.976006 1.144404
C  4.450283 1.834541 1.458267
C  4.120693 2.241202 -0.978538
C  1.097516 1.663108 -0.422784
C  -1.203619 2.264282 -0.350908
C  -2.282383 1.21121 -0.172115
C  -1.624626 3.56339 0.183706
C  -1.928923 -0.09179 0.145564
C  -3.614447 1.541539 -0.385222
C  -2.915641 -1.066152 0.239699
C  -4.588389 0.561877 -0.274192
C  -4.249154 -0.744318 0.032553
C  -1.417795 -2.889087 0.285265
C  -0.921819 -2.881183 -1.012747
C  -0.704831 -3.491702 1.310093
C  0.298267 -3.482273 -1.276802
C  0.511894 -4.097545 1.030958
C  1.020121 -4.091425 -0.259077
H  1.876496 1.189124 1.507563
H  2.834273 0.10794 -2.104105
H  3.984467 -1.083679 -1.512077
H  2.256376 -1.338082 -1.29551
H  3.357567 -0.575654 2.155943
H  2.618238 -1.757038 1.088558
H  4.351418 -1.45003 0.996788
H  4.411349 2.913817 1.613043
H  4.088946 1.366544 2.371707
H  5.499007 1.556752 1.336504
H  3.562064 2.046944 -1.887403
H  4.050187 3.311707 -0.779324
H  5.170682 2.014591 -1.17363
H  -1.005961 2.397071 -1.420944
H  -0.897499 -0.354433 0.3351
H  -3.900509 2.558084 -0.623131
H  -5.627097 0.820056 -0.430302
H  -5.00603 -1.512305 0.120344
H  -1.486078 -2.414842 -1.81028
H  -1.10814 -3.490373 2.31411
H  0.682176 -3.480485 -2.288468
H  1.06471 -4.574227 1.829783
H  1.969346 -4.563533 -0.47342
totalener: -1132.67485302 hartree
nucrepener: 2306.70026172 hartree
electener: -3439.37511474 hartree
oneelecener: -6121.61346732 hartree
twoeener: 2682.23835258 hartree
kineticenergy: 1127.70935738 hartree
xcener: -110.668011282282 hartree
chargesum: -0.0000000
charge: -0.284495 -0.381298 -0.296483 -0.006227 0.102745 0.091163 -0.153352 -0.262658 -0.250332 -0.255096 -0.276780 0.340976 0.342444 0.018794 -0.251708 -0.160379 -0.205544 0.235148 -0.079439 -0.209249 0.229797 -0.149748 -0.188774 -0.125071 -0.094515 -0.167139 0.079113 0.106822 0.091378 0.068039 0.078623 0.079444 0.091712 0.093336 0.077754 0.092459 0.104183 0.090216 0.088820 0.128509 0.126542 0.120584 0.128197 0.127333 0.134515 0.128383 0.139580 0.130167 0.131509
qa: -0.2845 -0.3813 -0.2965 -0.0062 0.1027 0.0912 -0.1534 -0.2627 -0.2503 -0.2551 -0.2768 0.3410 0.3424 0.0188 -0.2517 -0.1604 -0.2055 0.2351 -0.0794 -0.2092 0.2298 -0.1497 -0.1888 -0.1251 -0.0945 -0.1671 0.0791 0.1068 0.0914 0.0680 0.0786 0.0794 0.0917 0.0933 0.0778 0.0925 0.1042 0.0902 0.0888 0.1285 0.1265 0.1206 0.1282 0.1273 0.1345 0.1284 0.1396 0.1302 0.1315
va: 2.1026 2.1192 2.1141 3.1135 3.7117 3.7622 3.9419 3.9081 3.9111 3.9025 3.9207 4.1611 3.7843 3.7860 4.0091 3.9198 4.0524 3.8388 3.9587 4.0422 3.8231 3.9446 4.0285 3.8690 3.8721 3.8937 1.0345 1.0207 1.0006 1.0230 1.0131 1.0147 1.0020 1.0060 1.0100 1.0011 1.0171 1.0033 0.9990 1.0290 1.0171 1.0187 0.9994 1.0129 1.0031 1.0119 0.9959 0.9978 1.0004
dispcorr: -0.026510936 hartree
energy: -1132.701363953036
dipole: 30.80988 -29.86410 0.94577 -5.75734 4.12609 -1.63125 -0.04201 -0.02410 -0.06611
magnitude: 1.88675 au
magnitude: 4.79574 debye
