program: Orca
programVersion: 5.0.2
elementType: O O O N C C C C C C C C C C C C C C C C C C C C C C H H H H H H H H H H H H H H H H H H H H H H H
charge: 0
multiplicity: 1
keywords: wb97x-d3
keywords: def2-TZVPP
keywords: def2/J RIJCOSX
keywords: DEFGRID2
keywords: scfconv7
keywords: smallprint printgap noloewdin
keywords: NOSOSCF
formula: C22H23NO3
InChI: InChI=1/C22H23NO3/c1-21(2)19(22(21,3)4)20(24)26-18(14-23)15-9-8-12-17(13-15)25-16-10-6-5-7-11-16/h5-13,18-19H,1-4H3
49 atoms
O  -0.007188 1.977928 0.458724
O  1.04757 1.774361 -1.509338
O  -2.488311 -2.351417 0.659282
N  -2.018587 4.608034 0.79171
C  3.11474 0.111969 0.199641
C  3.655054 1.506606 0.220868
C  2.186168 1.274317 0.554034
C  2.952688 -0.633166 -1.105671
C  3.426551 -0.846136 1.329855
C  4.518804 1.966814 1.376623
C  4.059959 2.197261 -1.061887
C  1.074208 1.692362 -0.312581
C  -1.213319 2.321343 -0.187148
C  -2.258707 1.234967 -0.014134
C  -1.658411 3.599874 0.375494
C  -1.863696 -0.065239 0.259444
C  -3.605023 1.531863 -0.188269
C  -2.820751 -1.068832 0.347013
C  -4.549025 0.523531 -0.08428
C  -4.166015 -0.781796 0.176373
C  -1.354589 -2.910554 0.143916
C  -0.599773 -3.712108 0.987939
C  -0.986545 -2.743998 -1.186121
C  0.525945 -4.354834 0.495523
C  0.145377 -3.386398 -1.662627
C  0.906904 -4.192516 -0.828208
H  1.942308 1.349989 1.607983
H  3.882819 -1.15499 -1.339674
H  2.169909 -1.388571 -1.013677
H  2.701808 -0.006648 -1.954764
H  3.440631 -0.374936 2.310586
H  2.679705 -1.641677 1.362386
H  4.400115 -1.315382 1.174397
H  5.5558 1.661036 1.224798
H  4.503684 3.055588 1.446134
H  4.19868 1.579848 2.341877
H  3.465992 1.926061 -1.927546
H  3.986072 3.279745 -0.945366
H  5.103145 1.963773 -1.283621
H  -1.034877 2.476206 -1.257606
H  -0.822766 -0.310149 0.420237
H  -3.924369 2.546432 -0.389972
H  -5.59748 0.757057 -0.210845
H  -4.898446 -1.573839 0.257748
H  -0.903724 -3.834811 2.019186
H  -1.578843 -2.124732 -1.847436
H  1.10894 -4.984246 1.154881
H  0.428954 -3.257969 -2.698929
H  1.786557 -4.693484 -1.208755
totalener: -1132.67494057 hartree
nucrepener: 2303.62192644 hartree
electener: -3436.29686701 hartree
oneelecener: -6115.47576217 hartree
twoeener: 2679.17889515 hartree
kineticenergy: 1127.70929782 hartree
xcener: -110.667704737200 hartree
chargesum: -0.0000000
charge: -0.280905 -0.379756 -0.297868 -0.006682 0.095524 0.097070 -0.149451 -0.246289 -0.255909 -0.254607 -0.276756 0.326509 0.346002 0.020623 -0.247657 -0.158296 -0.201462 0.221885 -0.083712 -0.201214 0.226734 -0.195027 -0.136959 -0.111508 -0.137036 -0.134842 0.079518 0.091590 0.053993 0.105362 0.078941 0.087787 0.091795 0.092821 0.092915 0.077723 0.104637 0.090376 0.088496 0.128216 0.129183 0.121648 0.128947 0.128406 0.128719 0.131725 0.126887 0.133608 0.128293
qa: -0.2809 -0.3798 -0.2979 -0.0067 0.0955 0.0971 -0.1495 -0.2463 -0.2559 -0.2546 -0.2768 0.3265 0.3460 0.0206 -0.2477 -0.1583 -0.2015 0.2219 -0.0837 -0.2012 0.2267 -0.1950 -0.1370 -0.1115 -0.1370 -0.1348 0.0795 0.0916 0.0540 0.1054 0.0789 0.0878 0.0918 0.0928 0.0929 0.0777 0.1046 0.0904 0.0885 0.1282 0.1292 0.1216 0.1289 0.1284 0.1287 0.1317 0.1269 0.1336 0.1283
va: 2.1031 2.1190 2.1135 3.1123 3.7216 3.7505 3.9410 3.9118 3.9139 3.9023 3.9205 4.1715 3.7826 3.7706 4.0064 3.9400 4.0495 3.8498 3.9569 4.0411 3.8227 4.0165 3.9056 3.9146 3.8965 3.8876 1.0345 1.0019 1.0212 1.0207 1.0109 1.0057 1.0011 1.0009 1.0059 1.0098 1.0170 1.0032 0.9991 1.0288 1.0087 1.0185 0.9996 1.0118 1.0127 1.0041 0.9989 0.9996 1.0001
dispcorr: -0.026248366 hartree
energy: -1132.701188932700
dipole: 30.58915 -29.66191 0.92724 -5.64169 4.11989 -1.52180 -0.84205 0.66526 -0.17679
magnitude: 1.79078 au
magnitude: 4.55181 debye
