program: Orca
programVersion: 5.0.2
elementType: O O O N C C C C C C C C C C C C C C C C C C C C C C H H H H H H H H H H H H H H H H H H H H H H H
charge: 0
multiplicity: 1
keywords: wb97x-d3
keywords: def2-TZVPP
keywords: def2/J RIJCOSX
keywords: DEFGRID2
keywords: scfconv7
keywords: smallprint printgap noloewdin
keywords: NOSOSCF
formula: C22H23NO3
InChI: InChI=1/C22H23NO3/c1-21(2)19(22(21,3)4)20(24)26-18(14-23)15-9-8-12-17(13-15)25-16-10-6-5-7-11-16/h5-13,18-19H,1-4H3
49 atoms
O  1.838784 0.618747 -0.106564
O  1.070747 2.593631 0.621044
O  -3.559597 -2.158963 -0.13454
N  1.904109 -2.146674 1.719904
C  2.790294 3.694514 -1.796194
C  3.705235 3.776342 -0.614366
C  2.951209 2.480502 -0.882177
C  1.492594 4.469955 -1.818044
C  3.354067 3.541371 -3.1927
C  5.205004 3.705214 -0.811926
C  3.359064 4.648642 0.571411
C  1.857736 1.973755 -0.038115
C  0.812491 -0.064798 0.574602
C  -0.298907 -0.506499 -0.358933
C  1.438703 -1.22883 1.209913
C  -1.408367 -1.126594 0.20173
C  -0.222353 -0.308114 -1.727871
C  -2.43705 -1.567746 -0.617981
C  -1.271964 -0.730036 -2.533089
C  -2.373482 -1.365286 -1.99152
C  -3.499149 -2.981482 0.95636
C  -2.499001 -3.933683 1.111008
C  -4.521652 -2.873816 1.887026
C  -2.529552 -4.774543 2.212659
C  -4.545878 -3.730097 2.977137
C  -3.549404 -4.679251 3.148338
H  3.557511 1.68332 -1.298055
H  1.01472 4.574966 -0.849987
H  1.674035 5.471609 -2.211998
H  0.775088 3.984212 -2.481762
H  3.61758 4.515775 -3.608456
H  4.240872 2.912732 -3.239324
H  2.607443 3.095465 -3.852098
H  5.690629 3.402825 0.117114
H  5.510529 2.994926 -1.577572
H  5.603508 4.683104 -1.088459
H  3.746599 5.655384 0.404246
H  2.297944 4.729264 0.779017
H  3.835898 4.26185 1.473475
H  0.389917 0.564418 1.366143
H  -1.467004 -1.273706 1.274289
H  0.640189 0.163986 -2.175093
H  -1.220912 -0.573629 -3.602277
H  -3.185725 -1.707094 -2.618991
H  -1.703407 -4.023485 0.382459
H  -5.293395 -2.128239 1.748017
H  -1.74832 -5.512765 2.334745
H  -5.346826 -3.647021 3.69972
H  -3.56714 -5.340871 4.003536
totalener: -1132.67435090 hartree
nucrepener: 2190.64490448 hartree
electener: -3323.31925538 hartree
oneelecener: -5889.77596496 hartree
twoeener: 2566.45670958 hartree
kineticenergy: 1127.71742035 hartree
xcener: -110.667436656882 hartree
chargesum: -0.0000000
charge: -0.286566 -0.381102 -0.297476 -0.005919 0.090000 0.082722 -0.143860 -0.270640 -0.255872 -0.255907 -0.272968 0.333202 0.316494 0.100351 -0.245103 -0.237811 -0.188123 0.230163 -0.087939 -0.201194 0.249525 -0.170451 -0.214967 -0.104414 -0.087564 -0.146082 0.080147 0.106664 0.091434 0.085757 0.094025 0.079389 0.087561 0.092349 0.077822 0.093635 0.088597 0.104683 0.088941 0.133412 0.126235 0.126049 0.125295 0.128247 0.134179 0.125137 0.130396 0.125470 0.126075
qa: -0.2866 -0.3811 -0.2975 -0.0059 0.0900 0.0827 -0.1439 -0.2706 -0.2559 -0.2559 -0.2730 0.3332 0.3165 0.1004 -0.2451 -0.2378 -0.1881 0.2302 -0.0879 -0.2012 0.2495 -0.1705 -0.2150 -0.1044 -0.0876 -0.1461 0.0801 0.1067 0.0914 0.0858 0.0940 0.0794 0.0876 0.0923 0.0778 0.0936 0.0886 0.1047 0.0889 0.1334 0.1262 0.1260 0.1253 0.1282 0.1342 0.1251 0.1304 0.1255 0.1261
va: 2.0983 2.1176 2.1149 3.1201 3.7305 3.7580 3.9267 3.9208 3.9053 3.9064 3.9210 4.1567 3.7935 3.6759 3.9824 4.0110 4.0068 3.8679 3.9475 4.0401 3.7901 3.9499 4.0437 3.9494 3.9297 3.9637 1.0335 1.0168 0.9998 1.0039 1.0017 1.0096 1.0067 1.0062 1.0096 1.0011 0.9990 1.0168 1.0036 1.0302 1.0130 1.0153 1.0011 1.0121 1.0040 1.0141 0.9994 0.9989 1.0004
dispcorr: -0.023543886 hartree
energy: -1132.697894788604
dipole: 19.60023 -19.53159 0.06864 26.94520 -26.01741 0.92779 -10.36509 9.39279 -0.97230
magnitude: 1.34569 au
magnitude: 3.42048 debye
