program: Orca
programVersion: 5.0.2
elementType: O O O N C C C C C C C C C C C C C C C C C C C C C C H H H H H H H H H H H H H H H H H H H H H H H
charge: 0
multiplicity: 1
keywords: wb97x-d3
keywords: def2-TZVPP
keywords: def2/J RIJCOSX
keywords: DEFGRID2
keywords: scfconv7
keywords: smallprint printgap noloewdin
keywords: NOSOSCF
formula: C22H23NO3
InChI: InChI=1/C22H23NO3/c1-21(2)19(22(21,3)4)20(24)26-18(14-23)15-9-8-12-17(13-15)25-16-10-6-5-7-11-16/h5-13,18-19H,1-4H3
49 atoms
O  0.248856 1.787804 0.938957
O  0.730923 2.66182 -1.058843
O  -2.669381 -2.271825 -0.437806
N  -2.133931 2.302468 3.173202
C  3.135256 0.626237 -0.953159
C  3.700436 1.897544 -0.399841
C  2.377021 1.374697 0.141555
C  2.59318 0.574305 -2.363591
C  3.722766 -0.709846 -0.552203
C  4.862908 1.851463 0.569063
C  3.757314 3.149378 -1.24699
C  1.076886 2.020172 -0.104365
C  -1.092536 2.222119 0.777811
C  -1.876344 1.289793 -0.116303
C  -1.660792 2.261612 2.127565
C  -1.889112 -0.070023 0.171075
C  -2.556864 1.786162 -1.215069
C  -2.584631 -0.93437 -0.661354
C  -3.2676 0.913747 -2.027055
C  -3.278468 -0.443055 -1.762111
C  -1.676235 -2.922192 0.24042
C  -0.344408 -2.818546 -0.142345
C  -2.046128 -3.743322 1.293765
C  0.616468 -3.542816 0.544867
C  -1.075404 -4.470805 1.966192
C  0.25776 -4.370544 1.599418
H  2.436303 0.915831 1.122426
H  1.861671 -0.231083 -2.455217
H  2.107345 1.485767 -2.694595
H  3.406501 0.355683 -3.05824
H  2.983728 -1.500681 -0.696085
H  4.586678 -0.951859 -1.1742
H  4.040662 -0.753432 0.487309
H  5.80929 1.775398 0.030325
H  4.893824 2.768482 1.159499
H  4.814723 1.021527 1.271222
H  4.690978 3.160827 -1.812495
H  2.938449 3.255715 -1.949661
H  3.752611 4.03471 -0.609035
H  -1.128001 3.237413 0.369427
H  -1.36354 -0.447854 1.039739
H  -2.525403 2.842865 -1.444762
H  -3.802445 1.292501 -2.887478
H  -3.820522 -1.13005 -2.398465
H  -0.061026 -2.180796 -0.970426
H  -3.088175 -3.811836 1.576726
H  1.654171 -3.463686 0.247841
H  -1.365826 -5.112692 2.787136
H  1.012617 -4.935912 2.128742
totalener: -1132.67460796 hartree
nucrepener: 2297.33783896 hartree
electener: -3430.01244691 hartree
oneelecener: -6103.05477332 hartree
twoeener: 2673.04232640 hartree
kineticenergy: 1127.72535059 hartree
xcener: -110.666872370819 hartree
chargesum: -0.0000000
charge: -0.271189 -0.383788 -0.296311 -0.001659 0.079585 0.083081 -0.106818 -0.271000 -0.252085 -0.255825 -0.273008 0.321663 0.327894 0.033193 -0.261110 -0.190247 -0.144839 0.222814 -0.083531 -0.209392 0.225847 -0.162280 -0.188550 -0.110695 -0.096552 -0.141226 0.078230 0.082422 0.108120 0.091748 0.069181 0.096521 0.082159 0.092549 0.091663 0.077878 0.087641 0.104394 0.088111 0.117382 0.134004 0.107906 0.126979 0.128541 0.130955 0.127251 0.128656 0.127260 0.126475
qa: -0.2712 -0.3838 -0.2963 -0.0017 0.0796 0.0831 -0.1068 -0.2710 -0.2521 -0.2558 -0.2730 0.3217 0.3279 0.0332 -0.2611 -0.1902 -0.1448 0.2228 -0.0835 -0.2094 0.2258 -0.1623 -0.1886 -0.1107 -0.0966 -0.1412 0.0782 0.0824 0.1081 0.0917 0.0692 0.0965 0.0822 0.0925 0.0917 0.0779 0.0876 0.1044 0.0881 0.1174 0.1340 0.1079 0.1270 0.1285 0.1310 0.1273 0.1287 0.1273 0.1265
va: 2.1252 2.1109 2.1175 3.1232 3.7325 3.7546 3.9299 3.9212 3.9074 3.9056 3.9185 4.1883 3.8477 3.6659 4.0282 3.9485 4.0175 3.8503 3.9518 4.0380 3.8571 3.9649 4.0380 3.9356 3.9406 3.9861 1.0334 1.0053 1.0170 0.9992 1.0124 1.0030 1.0098 1.0013 1.0059 1.0101 0.9992 1.0174 1.0034 1.0214 1.0197 1.0154 0.9997 1.0119 1.0007 1.0127 0.9976 0.9987 1.0010
dispcorr: -0.025591200 hartree
energy: -1132.700199156649
dipole: 31.07283 -29.82568 1.24715 0.33394 -0.96440 -0.63046 -9.31577 8.32708 -0.98869
magnitude: 1.71184 au
magnitude: 4.35114 debye
