program: Orca
programVersion: 5.0.2
elementType: O O O N C C C C C C C C C C C C C C C C C C C C C C H H H H H H H H H H H H H H H H H H H H H H H
charge: 0
multiplicity: 1
keywords: wb97x-d3
keywords: def2-TZVPP
keywords: def2/J RIJCOSX
keywords: DEFGRID2
keywords: scfconv7
keywords: smallprint printgap noloewdin
keywords: NOSOSCF
formula: C22H23NO3
InChI: InChI=1/C22H23NO3/c1-21(2)19(22(21,3)4)20(24)26-18(14-23)15-9-8-12-17(13-15)25-16-10-6-5-7-11-16/h5-13,18-19H,1-4H3
49 atoms
O  0.339257 2.226909 -0.615834
O  1.802798 0.547869 -0.462819
O  -1.853087 -2.80924 1.3584
N  -2.408916 2.670779 -2.394284
C  3.574726 2.611837 1.117725
C  3.933219 2.866767 -0.312552
C  2.462324 2.79949 0.09204
C  3.829741 1.261116 1.747943
C  3.708848 3.71716 2.143614
C  4.432135 4.229578 -0.742856
C  4.553978 1.775437 -1.155227
C  1.561468 1.717755 -0.337927
C  -0.643621 1.297441 -1.041233
C  -1.297207 0.585582 0.119162
C  -1.627644 2.080631 -1.793773
C  -1.260037 -0.797318 0.180895
C  -1.92624 1.318328 1.119642
C  -1.884635 -1.454024 1.235456
C  -2.522313 0.654507 2.177258
C  -2.51432 -0.73158 2.236211
C  -2.119134 -3.602079 0.279007
C  -3.028068 -3.244001 -0.709327
C  -1.475653 -4.830996 0.230732
C  -3.277319 -4.122522 -1.752739
C  -1.743442 -5.702413 -0.812789
C  -2.639303 -5.3522 -1.812413
H  1.964862 3.762114 0.136043
H  3.725968 0.420435 1.070956
H  4.840993 1.239675 2.158765
H  3.137477 1.096178 2.575168
H  3.057023 3.51839 2.99594
H  4.732985 3.769616 2.518261
H  3.446483 4.701684 1.761625
H  5.504208 4.321392 -0.558209
H  4.270349 4.367208 -1.813093
H  3.937572 5.05536 -0.235488
H  4.352369 1.956439 -2.212464
H  5.637713 1.789468 -1.024008
H  4.203339 0.7748 -0.927124
H  -0.21035 0.56121 -1.726022
H  -0.742155 -1.363562 -0.583347
H  -1.957019 2.399241 1.069977
H  -3.014831 1.217879 2.958261
H  -2.990837 -1.256444 3.053551
H  -3.544643 -2.293862 -0.668778
H  -0.774312 -5.096667 1.010689
H  -3.985604 -3.840418 -2.520511
H  -1.24086 -6.66004 -0.845634
H  -2.841336 -6.032917 -2.628004
totalener: -1132.67533480 hartree
nucrepener: 2210.88271829 hartree
electener: -3343.55805309 hartree
oneelecener: -5930.34832869 hartree
twoeener: 2586.79027560 hartree
kineticenergy: 1127.72376306 hartree
xcener: -110.666349851856 hartree
chargesum: -0.0000000
charge: -0.269189 -0.392374 -0.298819 -0.003811 0.081811 0.081192 -0.121735 -0.272526 -0.255595 -0.254145 -0.276781 0.347691 0.322124 0.025925 -0.255346 -0.130092 -0.183891 0.200296 -0.099599 -0.181637 0.251229 -0.166132 -0.215942 -0.118375 -0.085867 -0.150215 0.075896 0.105657 0.088387 0.089220 0.090728 0.092103 0.077674 0.092981 0.091167 0.077569 0.087201 0.089684 0.105432 0.114557 0.121206 0.124414 0.129113 0.129056 0.134156 0.125528 0.129172 0.125326 0.125577
qa: -0.2692 -0.3924 -0.2988 -0.0038 0.0818 0.0812 -0.1217 -0.2725 -0.2556 -0.2541 -0.2768 0.3477 0.3221 0.0259 -0.2553 -0.1301 -0.1839 0.2003 -0.0996 -0.1816 0.2512 -0.1661 -0.2159 -0.1184 -0.0859 -0.1502 0.0759 0.1057 0.0884 0.0892 0.0907 0.0921 0.0777 0.0930 0.0912 0.0776 0.0872 0.0897 0.1054 0.1146 0.1212 0.1244 0.1291 0.1291 0.1342 0.1255 0.1292 0.1253 0.1256
va: 2.1304 2.1051 2.1115 3.1222 3.7262 3.7314 3.9404 3.9212 3.9071 3.9054 3.9230 4.1594 3.8462 3.6245 4.0184 3.9506 4.0282 3.8792 3.9423 4.0393 3.8035 3.9262 4.0389 3.9554 3.9344 3.9665 1.0335 1.0166 0.9992 1.0031 1.0059 1.0017 1.0102 1.0009 1.0061 1.0102 1.0035 0.9991 1.0169 1.0235 1.0178 1.0167 0.9996 1.0107 1.0047 1.0143 0.9996 0.9986 1.0005
dispcorr: -0.023418565 hartree
energy: -1132.698753365742
dipole: 29.31630 -28.28430 1.03201 12.52237 -12.65727 -0.13489 5.02270 -4.22255 0.80014
magnitude: 1.31281 au
magnitude: 3.33689 debye
