program: Orca
programVersion: 5.0.2
elementType: O O O N C C C C C C C C C C C C C C C C C C C C C C H H H H H H H H H H H H H H H H H H H H H H H
charge: 0
multiplicity: 1
keywords: wb97x-d3
keywords: def2-TZVPP
keywords: def2/J RIJCOSX
keywords: DEFGRID2
keywords: scfconv7
keywords: smallprint printgap noloewdin
keywords: NOSOSCF
formula: C22H23NO3
InChI: InChI=1/C22H23NO3/c1-21(2)19(22(21,3)4)20(24)26-18(14-23)15-9-8-12-17(13-15)25-16-10-6-5-7-11-16/h5-13,18-19H,1-4H3
49 atoms
O  0.136841 2.3983 -0.396298
O  1.026638 0.406027 -0.876027
O  -2.746336 -2.452271 0.590605
N  -2.518951 4.085169 -1.397803
C  3.245753 1.32815 1.172068
C  3.77098 1.734836 -0.169624
C  2.343797 2.103054 0.213453
C  2.96625 -0.125355 1.481456
C  3.672753 2.074528 2.417902
C  4.734761 2.896873 -0.284734
C  4.052832 0.699267 -1.235629
C  1.150774 1.507105 -0.409594
C  -1.117785 1.939857 -0.885501
C  -1.81663 1.058054 0.121714
C  -1.891829 3.15077 -1.168357
C  -1.973345 -0.290914 -0.155248
C  -2.247304 1.585314 1.332769
C  -2.544469 -1.125293 0.797698
C  -2.835268 0.747872 2.265876
C  -2.9781 -0.606164 2.009702
C  -1.885128 -3.189428 -0.17233
C  -0.507278 -3.014699 -0.130453
C  -2.445631 -4.181868 -0.963313
C  0.302224 -3.838755 -0.896976
C  -1.622251 -5.00595 -1.714034
C  -0.246114 -4.836648 -1.688664
H  2.199511 3.144336 0.479478
H  3.872102 -0.59705 1.866784
H  2.202135 -0.204263 2.257005
H  2.624601 -0.70705 0.631714
H  3.799408 3.143881 2.263362
H  2.927073 1.949599 3.204692
H  4.618316 1.680772 2.7958
H  4.503706 3.724365 0.382836
H  5.754502 2.571831 -0.069472
H  4.723714 3.293032 -1.301246
H  3.393392 -0.160972 -1.217126
H  3.970278 1.147755 -2.226857
H  5.077731 0.33988 -1.125831
H  -0.989839 1.397525 -1.827948
H  -1.629601 -0.690964 -1.100243
H  -2.132443 2.640496 1.545446
H  -3.180499 1.149732 3.208823
H  -3.427403 -1.265493 2.740509
H  -0.063167 -2.240412 0.481296
H  -3.520374 -4.305016 -0.981446
H  1.374166 -3.696129 -0.868652
H  -2.063205 -5.780387 -2.32735
H  0.393712 -5.476603 -2.280843
totalener: -1132.67517609 hartree
nucrepener: 2275.70317404 hartree
electener: -3408.37835013 hartree
oneelecener: -6059.90095169 hartree
twoeener: 2651.52260156 hartree
kineticenergy: 1127.72731006 hartree
xcener: -110.668302931156 hartree
chargesum: -0.0000000
charge: -0.259540 -0.402583 -0.296518 -0.003756 0.085269 0.085702 -0.122921 -0.276198 -0.255108 -0.256901 -0.272079 0.356127 0.319572 0.016281 -0.256765 -0.161856 -0.189378 0.251696 -0.086914 -0.207733 0.267627 -0.172822 -0.221737 -0.104032 -0.086351 -0.147115 0.078129 0.094601 0.091925 0.087793 0.078277 0.091223 0.092170 0.078055 0.093016 0.090924 0.102502 0.088685 0.088387 0.114402 0.124180 0.121316 0.128122 0.128061 0.129345 0.124657 0.122566 0.125567 0.124129
qa: -0.2595 -0.4026 -0.2965 -0.0038 0.0853 0.0857 -0.1229 -0.2762 -0.2551 -0.2569 -0.2721 0.3561 0.3196 0.0163 -0.2568 -0.1619 -0.1894 0.2517 -0.0869 -0.2077 0.2676 -0.1728 -0.2217 -0.1040 -0.0864 -0.1471 0.0781 0.0946 0.0919 0.0878 0.0783 0.0912 0.0922 0.0781 0.0930 0.0909 0.1025 0.0887 0.0884 0.1144 0.1242 0.1213 0.1281 0.1281 0.1293 0.1247 0.1226 0.1256 0.1241
va: 2.1379 2.0878 2.1229 3.1210 3.7300 3.7236 3.9383 3.9317 3.9062 3.9060 3.9205 4.1510 3.8483 3.6260 4.0169 3.9314 4.0442 3.8588 3.9332 4.0463 3.7995 3.9476 4.0434 3.9466 3.9298 3.9694 1.0332 1.0017 1.0018 1.0137 1.0105 1.0057 1.0012 1.0101 1.0009 1.0061 1.0162 1.0039 0.9988 1.0193 1.0183 1.0168 0.9996 1.0124 1.0024 1.0148 1.0003 0.9987 1.0007
dispcorr: -0.025063845 hartree
energy: -1132.700239940090
dipole: 32.28266 -30.85408 1.42859 1.07131 -1.85483 -0.78352 6.14778 -5.47978 0.66801
magnitude: 1.76096 au
magnitude: 4.47602 debye
