program: Orca
programVersion: 5.0.2
elementType: O O O N C C C C C C C C C C C C C C C C C C C C C C H H H H H H H H H H H H H H H H H H H H H H H
charge: 0
multiplicity: 1
keywords: wb97x-d3
keywords: def2-TZVPP
keywords: def2/J RIJCOSX
keywords: DEFGRID2
keywords: scfconv7
keywords: smallprint printgap noloewdin
keywords: NOSOSCF
formula: C22H23NO3
InChI: InChI=1/C22H23NO3/c1-21(2)19(22(21,3)4)20(24)26-18(14-23)15-9-8-12-17(13-15)25-16-10-6-5-7-11-16/h5-13,18-19H,1-4H3
49 atoms
O  0.673199 2.519129 0.667117
O  1.231027 1.887656 -1.402618
O  -2.328414 -2.341216 -0.752757
N  -2.208863 3.373179 2.043503
C  4.190602 2.261177 -0.380066
C  3.813015 3.61617 -0.890866
C  2.869216 2.885668 0.058572
C  4.211831 1.066745 -1.306798
C  5.241891 2.12333 0.700731
C  4.474845 4.854475 -0.32503
C  3.446591 3.816544 -2.343957
C  1.552822 2.370224 -0.351763
C  -0.635953 2.025843 0.448391
C  -0.74613 0.545771 0.733373
C  -1.504099 2.788468 1.350044
C  -1.479234 -0.257198 -0.122914
C  -0.150802 0.00459 1.866465
C  -1.624271 -1.611586 0.151126
C  -0.289164 -1.348799 2.120776
C  -1.021737 -2.166082 1.272679
C  -2.985724 -3.472393 -0.353897
C  -3.893886 -3.448209 0.697033
C  -2.763609 -4.637483 -1.07039
C  -4.57798 -4.60691 1.028073
C  -3.461415 -5.788331 -0.734025
C  -4.365886 -5.779528 0.316481
H  2.867723 3.269756 1.072792
H  5.188564 0.999758 -1.78984
H  4.065996 0.147535 -0.736944
H  3.454652 1.085896 -2.082832
H  5.1278 1.168331 1.216104
H  6.24312 2.144795 0.265938
H  5.193621 2.90387 1.457271
H  5.426402 5.044055 -0.825568
H  3.839233 5.726516 -0.486645
H  4.670364 4.794945 0.743642
H  2.94479 2.972033 -2.803466
H  2.789701 4.681484 -2.45082
H  4.351255 4.022569 -2.919403
H  -0.960711 2.225294 -0.57824
H  -1.938969 0.153926 -1.013293
H  0.414315 0.630036 2.544521
H  0.178522 -1.781127 2.99516
H  -1.1161 -3.22275 1.485228
H  -4.06954 -2.531977 1.246409
H  -2.055367 -4.634989 -1.888425
H  -5.287963 -4.588812 1.844275
H  -3.291126 -6.69708 -1.295902
H  -4.906151 -6.679253 0.577722
totalener: -1132.67511080 hartree
nucrepener: 2175.93800055 hartree
electener: -3308.61311134 hartree
oneelecener: -5860.45797358 hartree
twoeener: 2551.84486223 hartree
kineticenergy: 1127.72397546 hartree
xcener: -110.666110496311 hartree
chargesum: -0.0000000
charge: -0.276395 -0.383751 -0.295428 -0.003971 0.080826 0.084371 -0.119041 -0.272810 -0.255501 -0.255151 -0.274924 0.329826 0.310120 0.060067 -0.249576 -0.176456 -0.185829 0.198321 -0.116098 -0.142215 0.216495 -0.152957 -0.192649 -0.118130 -0.099892 -0.134587 0.076597 0.088982 0.087667 0.105378 0.089337 0.092927 0.077932 0.092550 0.091792 0.077761 0.104623 0.088447 0.088530 0.118778 0.108479 0.124330 0.127987 0.134465 0.137570 0.127335 0.129405 0.126950 0.127511
qa: -0.2764 -0.3838 -0.2954 -0.0040 0.0808 0.0844 -0.1190 -0.2728 -0.2555 -0.2552 -0.2749 0.3298 0.3101 0.0601 -0.2496 -0.1765 -0.1858 0.1983 -0.1161 -0.1422 0.2165 -0.1530 -0.1926 -0.1181 -0.0999 -0.1346 0.0766 0.0890 0.0877 0.1054 0.0893 0.0929 0.0779 0.0926 0.0918 0.0778 0.1046 0.0884 0.0885 0.1188 0.1085 0.1243 0.1280 0.1345 0.1376 0.1273 0.1294 0.1269 0.1275
va: 2.1138 2.1124 2.1080 3.1241 3.7279 3.7344 3.9316 3.9221 3.9069 3.9060 3.9222 4.1759 3.8370 3.6832 4.0175 4.0857 4.0207 3.9127 3.9643 3.9281 3.8244 3.9577 4.0344 3.9438 3.9357 3.9528 1.0335 0.9989 1.0036 1.0170 1.0065 1.0012 1.0100 1.0013 1.0059 1.0101 1.0170 1.0034 0.9994 1.0263 1.0255 1.0197 1.0013 1.0040 1.0019 1.0125 0.9996 0.9990 0.9999
dispcorr: -0.023144335 hartree
energy: -1132.698255132444
dipole: 31.10782 -29.84664 1.26118 8.98086 -10.00189 -1.02103 -5.43504 5.32161 -0.11343
magnitude: 1.62663 au
magnitude: 4.13457 debye
