program: Orca
programVersion: 5.0.2
elementType: O O O N C C C C C C C C C C C C C C C C C C C C C C H H H H H H H H H H H H H H H H H H H H H H H
charge: 0
multiplicity: 1
keywords: wb97x-d3
keywords: def2-TZVPP
keywords: def2/J RIJCOSX
keywords: DEFGRID2
keywords: scfconv7
keywords: smallprint printgap noloewdin
keywords: NOSOSCF
formula: C22H23NO3
InChI: InChI=1/C22H23NO3/c1-21(2)19(22(21,3)4)20(24)26-18(14-23)15-9-8-12-17(13-15)25-16-10-6-5-7-11-16/h5-13,18-19H,1-4H3
49 atoms
O  0.843862 1.955042 0.527523
O  0.895274 2.950348 -1.476429
O  -1.608159 -2.75743 1.316379
N  -1.406787 2.453569 2.899766
C  3.939989 2.216383 -1.45672
C  3.902263 3.521587 -0.726332
C  2.938215 2.409736 -0.323668
C  3.480433 2.126791 -2.894554
C  5.052304 1.225613 -1.184288
C  4.974803 3.855413 0.288292
C  3.397773 4.771638 -1.411336
C  1.484018 2.489416 -0.534644
C  -0.577656 1.909024 0.482534
C  -1.0449 0.558723 -0.003364
C  -1.035193 2.208364 1.840938
C  -1.174647 -0.505119 0.876952
C  -1.290426 0.377202 -1.359305
C  -1.545951 -1.754668 0.401672
C  -1.656523 -0.87628 -1.822513
C  -1.78522 -1.94829 -0.953896
C  -2.491081 -3.787119 1.148574
C  -2.011354 -5.078485 1.305192
C  -3.836937 -3.55742 0.89204
C  -2.888949 -6.148252 1.21105
C  -4.701067 -4.636095 0.791234
C  -4.233591 -5.933373 0.949511
H  3.196529 1.9041 0.600074
H  2.681067 2.810694 -3.156404
H  4.325391 2.330796 -3.555332
H  3.129605 1.117471 -3.116411
H  5.943488 1.482089 -1.760536
H  5.341065 1.17007 -0.136723
H  4.74366 0.223261 -1.485423
H  4.608736 4.607829 0.988497
H  5.298251 3.000007 0.877762
H  5.856003 4.267864 -0.206985
H  4.220975 5.248517 -1.946989
H  2.592289 4.60539 -2.118237
H  3.035512 5.485597 -0.669611
H  -0.963911 2.691067 -0.177687
H  -0.99802 -0.379593 1.938426
H  -1.184533 1.205001 -2.047434
H  -1.841726 -1.025223 -2.877848
H  -2.067395 -2.922534 -1.3311
H  -0.960382 -5.237018 1.508234
H  -4.208169 -2.546382 0.781545
H  -2.514937 -7.155566 1.338502
H  -5.750345 -4.457892 0.596437
H  -4.914718 -6.77006 0.874573
totalener: -1132.67591359 hartree
nucrepener: 2172.94446203 hartree
electener: -3305.62037562 hartree
oneelecener: -5854.47398395 hartree
twoeener: 2548.85360833 hartree
kineticenergy: 1127.72492810 hartree
xcener: -110.666875969191 hartree
chargesum: -0.0000000
charge: -0.263780 -0.405264 -0.294838 -0.006695 0.081900 0.086008 -0.128696 -0.275276 -0.254797 -0.255312 -0.277126 0.366034 0.329382 0.003333 -0.257986 -0.196406 -0.145660 0.194271 -0.116181 -0.149196 0.220268 -0.194365 -0.150428 -0.099339 -0.117743 -0.136006 0.076560 0.104286 0.088171 0.088092 0.091837 0.078282 0.090284 0.091431 0.077979 0.092203 0.089347 0.104453 0.088430 0.121776 0.121137 0.131026 0.129932 0.134424 0.126464 0.135909 0.126780 0.128124 0.126969
qa: -0.2638 -0.4053 -0.2948 -0.0067 0.0819 0.0860 -0.1287 -0.2753 -0.2548 -0.2553 -0.2771 0.3660 0.3294 0.0033 -0.2580 -0.1964 -0.1457 0.1943 -0.1162 -0.1492 0.2203 -0.1944 -0.1504 -0.0993 -0.1177 -0.1360 0.0766 0.1043 0.0882 0.0881 0.0918 0.0783 0.0903 0.0914 0.0780 0.0922 0.0893 0.1045 0.0884 0.1218 0.1211 0.1310 0.1299 0.1344 0.1265 0.1359 0.1268 0.1281 0.1270
va: 2.1226 2.0858 2.1070 3.1158 3.7246 3.7230 3.9389 3.9215 3.9075 3.9083 3.9219 4.1471 3.7953 3.7447 4.0248 4.1096 3.9648 3.9147 3.9645 3.9403 3.8205 4.0340 3.9491 3.9395 3.9442 3.9539 1.0340 1.0164 0.9993 1.0034 1.0011 1.0105 1.0058 1.0062 1.0101 1.0008 0.9992 1.0169 1.0033 1.0257 1.0315 1.0198 1.0012 1.0043 1.0130 1.0021 0.9989 0.9998 1.0000
dispcorr: -0.023076709 hartree
energy: -1132.698990302253
dipole: 27.80026 -27.07160 0.72866 10.87208 -11.75050 -0.87842 -14.22004 12.90899 -1.31105
magnitude: 1.73822 au
magnitude: 4.41821 debye
