program: Gaussian 09
title: 000007242
version: EM64L-G09RevD.01
frameworkgroup: C1[X(C7H9N)]
method: RPBEPBE
basis: SDD
operation: Freq
keyword: #p
keyword: freq=noraman
keyword: PBEPBE/SDD
title: #p freq=noraman PBEPBE/SDD
converged: NO NO NO NO
title: Mulliken charges:
elementType: N C C C C C C C H H H H H H H H H
charge: -0.703890 0.331379 0.309677 -0.389200 -0.399963 -0.838191 -0.268402 -0.214954 0.220886 0.209841 0.222965 0.222748 0.236406 0.220949 0.217916 0.320581 0.301253
chargesum: 0.00000
title: Mulliken charges with hydrogens summed into heavy atoms:
elementType: N C C C C C C C
charge: -0.082056 0.331379 0.309677 -0.168314 -0.190122 -0.156073 -0.047453 0.002961
polarizability: 1.05424075e+02 3.47088100e+00 9.30083430e+01 7.71700261e-03 4.68092524e-03 3.95531683e+01
1716.lowfreq: -0.0006 -0.0006 0.0005 10.1760 13.1005 13.5149 164.0931 190.0748 254.4504
frequency: 164.0878 190.0681 254.4500 294.2651 301.3708 391.5961 410.1719 438.3301 506.0189 543.8035 577.8712 718.6163 737.1110 752.4307 834.9853 842.9244 925.1102 963.2739 976.2660 1004.6964 1041.1089 1052.9135 1135.2227 1169.9337 1203.4591 1290.6383 1310.0393 1385.7690 1397.9617 1441.6666 1472.7956 1484.7265 1500.0185 1592.7724 1617.8657 1637.8628 2947.2788 3013.5497 3081.3154 3110.0162 3117.0143 3134.8204 3159.3786 3574.7154 3716.7698
redmass: 2.5923 1.0772 3.2993 1.1725 2.7006 1.0888 2.7760 2.8359 4.6910 3.3593 6.0101 2.2140 4.3795 1.5312 4.2545 1.3894 1.3654 1.3058 1.6453 1.7556 1.5082 1.6745 1.3735 1.0511 3.1705 1.6423 1.9969 2.3261 1.9489 2.1014 1.0455 1.2145 2.9682 6.5743 3.2604 1.4032 1.0392 1.0975 1.0952 1.0861 1.0887 1.0932 1.1003 1.0446 1.1037
irintensity: 2.4794 3.5080 0.8286 264.6595 0.7475 39.9975 1.5780 3.9906 2.6017 1.1528 0.4658 15.1517 0.3803 86.8308 5.1469 2.6032 2.0902 0.2091 5.0307 1.2307 5.9108 19.1526 18.2744 2.0850 0.5274 6.1818 38.1077 1.0269 20.0255 12.1894 13.1919 14.1553 84.5300 13.4681 5.2986 209.8031 47.8981 31.3810 16.4380 18.8745 6.9801 38.7888 25.9427 46.9501 20.9414
temp: 298.150 k
press: 1.00000 atm
elementType: 7 6 6 6 6 6 6 6 1 1 1 1 1 1 1 1 1
symmnumber: 1
zpe: 373336.9 jmol-1
zpe.correction: 0.142197 hartree
zpe.thermalcorrener: 0.149816 hartree
zpe.thermalcorrenthalpy: 0.150760 hartree
zpe.thermalcorrgfe: 0.110988 hartree
zpe.sumelectzpe: -326.314297 hartree
zpe.sumelectthermal: -326.306677 hartree
zpe.sumelectthermalent: -326.305733 hartree
zpe.sumelectthermalfe: -326.345506 hartree
dipole: 2.0163 1.0004 0.0078
dipole: 2.2508
quadrupole: -40.6740 -40.1453 -53.5622
quadrupole: 1.7522 0.0196 0.0164
quadrupole: 4.1199 4.6485 -8.7683 1.7522 0.0196 0.0164
hfenergy: -326.4564938 hartree
pointgroup: C01 [X(C7H9N1)]
dipole: 0.8060726 -0.3666441 -0.0030567 debye
dipolederiv: -1.0270895 0.6025651 -0.0010644 0.573504 -0.5157076 0.0003778 -0.0028698 0.0017103 -0.7420479 0.0285192 0.0948973 -0.00005 0.4916385 -0.1349794 0.0000296 0.0001378 0.0000525 -0.0929527 0.9519578 -0.7149438 0.0004577 -0.7309614 0.3699025 -0.0001405 0.0002125 -0.0001047 0.1088241 0.197276 0.0309952 0.0000207 -0.0645435 0.1072316 -0.0000315 -0.0000418 0.0000236 -0.1603978 -0.2999602 0.3262015 -0.0000051 -0.1089257 0.0631657 0.0000374 0.0001316 -0.0002023 -0.2341906 -0.0573737 -0.0372782 -0.0001004 -0.0434174 0.049483 0.0000657 -0.0002779 0.0000624 0.1114185 -0.1577183 -0.0841673 -0.0000866 -0.124242 -0.2078917 0.0000455 -0.0000675 0.0000293 -0.2275825 0.0968068 -0.1197381 0.000009 0.0644203 0.2149243 -0.0000005 0.0000011 0.0000282 -0.1469826 0.0848386 -0.0393759 0.0000175 -0.0109205 -0.145659 -0.0000232 0.0000257 -0.0000159 0.1474835 0.0649885 0.0278179 0.0000036 -0.0027144 -0.1620705 -0.0000725 0.0000124 -0.0000421 0.1681123 -0.060374 -0.034805 -0.0986255 0.0316059 0.0709741 0.0797633 -0.1353159 0.0195725 -0.0603176 -0.0605605 -0.0347381 0.0987619 0.0318121 0.070809 -0.0799421 0.1354663 -0.0196672 -0.0604612 0.0868286 0.0819695 -0.0000106 -0.0341882 -0.1429203 0.0000333 0.0000192 -0.0000027 0.109885 -0.0879115 0.0943638 0.0000582 0.103252 0.0169426 -0.0000373 0.0000662 -0.0000289 0.1774288 -0.0977317 -0.0976475 0.0000292 -0.1050069 0.0340094 0.0000005 0.0000106 0.0000067 0.1559623 0.1726608 -0.0470408 0.0004473 -0.0254356 0.1677692 0.0002276 0.0017059 -0.0002887 0.3647201 0.164843 -0.0490755 0.0001377 -0.0458771 0.1440172 -0.0003331 0.0007835 -0.001133 0.3810981 unknown
polarizability: 105.6437932|-3.0447941|92.7886244|-0.0078704|0.0044182|39.5531683 unknown
InChI: InChI=1S/C7H9N/c1-6-4-2-3-5-7(6)8/h2-5H,8H2,1H3
charge 0 multiplicity 1
17 atoms
N  1.754009 -1.493445 0.000085
C  0.628311 0.690398 -0.000093
C  0.572045 -0.740701 -0.000187
C  -0.586391 1.414499 0.000136
C  -0.691751 -1.396784 -0.000082
C  1.969726 1.402993 -0.000146
C  -1.843931 0.765619 0.000277
C  -1.886785 -0.648354 0.00017
H  -0.544998 2.511045 0.000214
H  -0.732178 -2.493766 -0.000173
H  2.574602 1.146731 0.894199
H  2.574676 1.146618 -0.894431
H  1.833648 2.497614 -0.000284
H  -2.769558 1.35116 0.000489
H  -2.850889 -1.170204 0.000228
H  2.662748 -1.042985 -0.002504
H  1.715016 -2.508035 -0.001697
