program: Orca
programVersion: 5.0.2
elementType: O O O N C C C C C C C C C C C C C C C C C C C C C C H H H H H H H H H H H H H H H H H H H H H H H
charge: 0
multiplicity: 1
keywords: wb97x-d3
keywords: def2-TZVPP
keywords: def2/J RIJCOSX
keywords: DEFGRID2
keywords: scfconv7
keywords: smallprint printgap noloewdin
keywords: NOSOSCF
formula: C22H23NO3
InChI: InChI=1/C22H23NO3/c1-21(2)19(22(21,3)4)20(24)26-18(14-23)15-9-8-12-17(13-15)25-16-10-6-5-7-11-16/h5-13,18-19H,1-4H3
49 atoms
O  0.787227 2.014547 0.152415
O  1.628577 2.323277 -1.900424
O  -1.925199 -3.015465 -0.543955
N  -2.199615 3.509639 -0.094968
C  4.392322 2.425325 -0.40125
C  3.928934 3.847933 -0.389827
C  2.971623 2.746724 0.053783
C  4.643458 1.708094 -1.708572
C  5.325853 1.919649 0.67862
C  4.393118 4.789828 0.70107
C  3.704132 4.594903 -1.684799
C  1.774172 2.359224 -0.70925
C  -0.450729 1.584661 -0.386066
C  -0.8995 0.337606 0.333718
C  -1.425404 2.670054 -0.22108
C  -1.235003 -0.785499 -0.403282
C  -0.978757 0.315357 1.721759
C  -1.648137 -1.944195 0.244813
C  -1.380174 -0.846126 2.35661
C  -1.714239 -1.981089 1.630955
C  -2.828306 -3.952607 -0.122303
C  -4.103311 -3.592811 0.295725
C  -2.449852 -5.284794 -0.174296
C  -4.996823 -4.582316 0.673313
C  -3.357412 -6.265985 0.197254
C  -4.628868 -5.919987 0.62856
H  2.819167 2.687369 1.125686
H  5.673248 1.88493 -2.025303
H  4.524111 0.631271 -1.576214
H  3.989659 2.00746 -2.520382
H  6.362314 2.159436 0.433387
H  5.11635 2.331293 1.663744
H  5.250855 0.834191 0.761553
H  5.375035 5.201201 0.458985
H  3.699646 5.627035 0.794115
H  4.463749 4.322091 1.681099
H  2.986467 5.402777 -1.532578
H  4.642508 5.049757 -2.007884
H  3.331268 3.984293 -2.49958
H  -0.356823 1.386422 -1.457826
H  -1.17866 -0.778044 -1.485125
H  -0.728392 1.193641 2.301731
H  -1.435228 -0.876544 3.436521
H  -2.021072 -2.881869 2.145962
H  -4.397162 -2.55092 0.323004
H  -1.453991 -5.544747 -0.508662
H  -5.99048 -4.303469 0.998536
H  -3.062892 -7.30625 0.154566
H  -5.3319 -6.687435 0.922455
totalener: -1132.67498508 hartree
nucrepener: 2148.06795722 hartree
electener: -3280.74294229 hartree
oneelecener: -5804.64974708 hartree
twoeener: 2523.90680479 hartree
kineticenergy: 1127.71876721 hartree
xcener: -110.664992188892 hartree
chargesum: -0.0000000
charge: -0.278138 -0.390405 -0.296851 -0.003191 0.083442 0.085697 -0.142011 -0.275934 -0.254732 -0.255351 -0.274668 0.364084 0.325637 0.043203 -0.267130 -0.170282 -0.185595 0.202134 -0.110917 -0.148103 0.223190 -0.157531 -0.193629 -0.116208 -0.099133 -0.135111 0.073810 0.088902 0.087464 0.105308 0.092248 0.076988 0.090433 0.092603 0.092858 0.076258 0.090702 0.088299 0.104649 0.116195 0.116298 0.122531 0.129821 0.135119 0.137192 0.126376 0.129158 0.127012 0.127313
qa: -0.2781 -0.3904 -0.2969 -0.0032 0.0834 0.0857 -0.1420 -0.2759 -0.2547 -0.2554 -0.2747 0.3641 0.3256 0.0432 -0.2671 -0.1703 -0.1856 0.2021 -0.1109 -0.1481 0.2232 -0.1575 -0.1936 -0.1162 -0.0991 -0.1351 0.0738 0.0889 0.0875 0.1053 0.0922 0.0770 0.0904 0.0926 0.0929 0.0763 0.0907 0.0883 0.1046 0.1162 0.1163 0.1225 0.1298 0.1351 0.1372 0.1264 0.1292 0.1270 0.1273
va: 2.1360 2.1076 2.1066 3.1222 3.7212 3.7255 3.9381 3.9244 3.9068 3.9064 3.9228 4.1663 3.7825 3.7656 4.0446 4.0308 4.0466 3.9174 3.9561 3.9318 3.8157 3.9574 4.0346 3.9445 3.9352 3.9540 1.0317 0.9994 1.0029 1.0170 1.0013 1.0102 1.0058 1.0010 1.0062 1.0098 1.0031 0.9988 1.0171 1.0448 1.0223 1.0189 1.0007 1.0037 1.0018 1.0126 0.9996 0.9990 1.0000
dispcorr: -0.022509483 hartree
energy: -1132.697494558095
dipole: 30.40058 -29.37964 1.02094 12.10318 -13.39111 -1.28793 1.24333 -0.36966 0.87367
magnitude: 1.86128 au
magnitude: 4.73101 debye
