program: Orca
programVersion: 5.0.2
elementType: O O O N C C C C C C C C C C C C C C C C C C C C C C H H H H H H H H H H H H H H H H H H H H H H H
charge: 0
multiplicity: 1
keywords: wb97x-d3
keywords: def2-TZVPP
keywords: def2/J RIJCOSX
keywords: DEFGRID2
keywords: scfconv7
keywords: smallprint printgap noloewdin
keywords: NOSOSCF
formula: C22H23NO3
InChI: InChI=1/C22H23NO3/c1-21(2)19(22(21,3)4)20(24)26-18(14-23)15-9-8-12-17(13-15)25-16-10-6-5-7-11-16/h5-13,18-19H,1-4H3
49 atoms
O  0.878905 1.957827 0.261622
O  1.567817 2.315825 -1.840655
O  -2.109595 -2.981905 -0.645855
N  -2.160731 3.304168 0.505817
C  4.421326 2.525797 -0.516884
C  3.901184 3.927665 -0.471967
C  3.018109 2.786215 0.023906
C  4.624301 1.827485 -1.842632
C  5.436427 2.054861 0.502886
C  4.388188 4.887663 0.592769
C  3.574071 4.665894 -1.750164
C  1.791542 2.348902 -0.66202
C  -0.386125 1.511627 -0.190372
C  -0.720428 0.177697 0.432378
C  -1.378443 2.521021 0.197882
C  -1.268893 -0.817125 -0.360238
C  -0.519208 -0.040095 1.790234
C  -1.617242 -2.039751 0.200895
C  -0.862453 -1.264459 2.336584
C  -1.410297 -2.270573 1.554255
C  -3.022824 -3.894148 -0.19365
C  -2.808262 -5.228549 -0.501802
C  -4.160838 -3.5018 0.500501
C  -3.744989 -6.176657 -0.1175
C  -5.083098 -4.460853 0.88762
C  -4.881397 -5.799667 0.581496
H  2.935206 2.721083 1.103072
H  3.897024 2.085885 -2.604279
H  5.615674 2.069814 -2.230174
H  4.582474 0.745307 -1.708883
H  5.269057 2.454662 1.50091
H  5.409517 0.966871 0.583745
H  6.446402 2.336721 0.198667
H  3.655544 5.681633 0.744712
H  4.557921 4.418575 1.559771
H  5.323747 5.35793 0.284443
H  4.477305 5.145748 -2.132365
H  3.166948 4.0441 -2.53989
H  2.846011 5.454429 -1.552524
H  -0.399003 1.429499 -1.281305
H  -1.430846 -0.657824 -1.419512
H  -0.099085 0.735402 2.416239
H  -0.701295 -1.444714 3.390954
H  -1.669262 -3.223356 1.996914
H  -1.917676 -5.515206 -1.045428
H  -4.329462 -2.457251 0.730593
H  -3.579838 -7.217463 -0.362853
H  -5.970763 -4.15517 1.425524
H  -5.608437 -6.542022 0.881229
totalener: -1132.67469626 hartree
nucrepener: 2145.94614431 hartree
electener: -3278.62084057 hartree
oneelecener: -5800.40218663 hartree
twoeener: 2521.78134606 hartree
kineticenergy: 1127.71586774 hartree
xcener: -110.664667522179 hartree
chargesum: -0.0000000
charge: -0.282540 -0.389230 -0.296959 -0.004568 0.087714 0.085432 -0.149171 -0.276851 -0.254376 -0.254876 -0.275750 0.367093 0.324059 0.046335 -0.262445 -0.177024 -0.181703 0.195068 -0.109483 -0.141551 0.221025 -0.197335 -0.151104 -0.097886 -0.119284 -0.136066 0.073990 0.104641 0.089530 0.087481 0.077002 0.090394 0.092384 0.093401 0.076381 0.092349 0.088684 0.105039 0.090029 0.120516 0.114894 0.123320 0.128967 0.134977 0.127102 0.137010 0.126463 0.129857 0.127064
qa: -0.2825 -0.3892 -0.2970 -0.0046 0.0877 0.0854 -0.1492 -0.2769 -0.2544 -0.2549 -0.2758 0.3671 0.3241 0.0463 -0.2624 -0.1770 -0.1817 0.1951 -0.1095 -0.1416 0.2210 -0.1973 -0.1511 -0.0979 -0.1193 -0.1361 0.0740 0.1046 0.0895 0.0875 0.0770 0.0904 0.0924 0.0934 0.0764 0.0923 0.0887 0.1050 0.0900 0.1205 0.1149 0.1233 0.1290 0.1350 0.1271 0.1370 0.1265 0.1299 0.1271
va: 2.1239 2.1113 2.1049 3.1214 3.7154 3.7257 3.9399 3.9254 3.9061 3.9067 3.9228 4.1650 3.7673 3.7744 4.0394 4.0498 4.0357 3.9219 3.9548 3.9327 3.8187 4.0330 3.9502 3.9363 3.9481 3.9547 1.0317 1.0170 0.9991 1.0032 1.0102 1.0058 1.0013 1.0060 1.0099 1.0010 0.9990 1.0169 1.0033 1.0468 1.0229 1.0201 1.0010 1.0035 1.0126 1.0019 0.9989 0.9995 1.0000
dispcorr: -0.022501389 hartree
energy: -1132.697197649723
dipole: 30.50291 -29.36284 1.14008 13.18817 -14.37569 -1.18751 -0.54430 1.16637 0.62208
magnitude: 1.75982 au
magnitude: 4.47310 debye
