program: Orca
programVersion: 5.0.2
elementType: O O O N C C C C C C C C C C C C C C C C C C C C C C H H H H H H H H H H H H H H H H H H H H H H H
charge: 0
multiplicity: 1
keywords: wb97x-d3
keywords: def2-TZVPP
keywords: def2/J RIJCOSX
keywords: DEFGRID2
keywords: scfconv7
keywords: smallprint printgap noloewdin
keywords: NOSOSCF
formula: C22H23NO3
InChI: InChI=1/C22H23NO3/c1-21(2)19(22(21,3)4)20(24)26-18(14-23)15-9-8-12-17(13-15)25-16-10-6-5-7-11-16/h5-13,18-19H,1-4H3
49 atoms
O  0.922663 1.831441 0.441746
O  0.920917 2.962222 -1.490894
O  -1.586224 -2.842288 1.297018
N  -1.242849 2.378642 2.891108
C  3.982219 2.380536 -1.59366
C  3.920313 3.54262 -0.651569
C  2.993997 2.346466 -0.435583
C  3.513137 2.520805 -3.024735
C  5.127465 1.393828 -1.502425
C  4.99724 3.737489 0.394107
C  3.362207 4.872047 -1.105815
C  1.534093 2.43736 -0.599837
C  -0.499813 1.813975 0.450772
C  -1.012237 0.475502 -0.019594
C  -0.906672 2.124104 1.822846
C  -1.121061 -0.593156 0.858115
C  -1.328908 0.311983 -1.362382
C  -1.54536 -1.828901 0.391983
C  -1.748771 -0.927881 -1.817287
C  -1.859057 -2.003696 -0.951364
C  -2.532038 -3.822801 1.183209
C  -2.113694 -5.138339 1.31101
C  -3.876485 -3.521561 1.005334
C  -3.051072 -6.159471 1.266164
C  -4.801014 -4.552302 0.95264
C  -4.394979 -5.872943 1.082054
H  3.280698 1.704436 0.389935
H  4.345912 2.859757 -3.644049
H  3.19273 1.552298 -3.412023
H  2.689345 3.21103 -3.166565
H  6.003225 1.77346 -2.0323
H  5.430232 1.168583 -0.481931
H  4.845234 0.448817 -1.969107
H  4.613935 4.337365 1.220861
H  5.367038 2.806217 0.817955
H  5.850449 4.270217 -0.030539
H  4.157254 5.463189 -1.564002
H  2.548943 4.798463 -1.820139
H  2.990945 5.435956 -0.248337
H  -0.893493 2.603622 -0.195745
H  -0.888728 -0.480562 1.910269
H  -1.238919 1.144454 -2.047583
H  -1.991942 -1.062377 -2.862743
H  -2.185527 -2.967354 -1.320089
H  -1.062806 -5.353525 1.452371
H  -4.199856 -2.492114 0.918357
H  -2.724351 -7.185601 1.369967
H  -5.848634 -4.317923 0.818594
H  -5.122382 -6.672353 1.044746
totalener: -1132.67581933 hartree
nucrepener: 2166.78961122 hartree
electener: -3299.46543055 hartree
oneelecener: -5842.15930889 hartree
twoeener: 2542.69387834 hartree
kineticenergy: 1127.72334260 hartree
xcener: -110.666298314835 hartree
chargesum: -0.0000000
charge: -0.264008 -0.402355 -0.295567 -0.006394 0.089435 0.079065 -0.133897 -0.271841 -0.257169 -0.254742 -0.279553 0.367232 0.324941 0.008165 -0.258154 -0.195591 -0.142280 0.187006 -0.117760 -0.143430 0.217835 -0.194687 -0.147065 -0.099304 -0.118853 -0.136274 0.075801 0.087580 0.086983 0.103970 0.092129 0.077890 0.090847 0.093202 0.077294 0.092352 0.090999 0.103096 0.090949 0.121841 0.121668 0.129840 0.130170 0.134364 0.126810 0.135585 0.126611 0.128417 0.126850
qa: -0.2640 -0.4024 -0.2956 -0.0064 0.0894 0.0791 -0.1339 -0.2718 -0.2572 -0.2547 -0.2796 0.3672 0.3249 0.0082 -0.2582 -0.1956 -0.1423 0.1870 -0.1178 -0.1434 0.2178 -0.1947 -0.1471 -0.0993 -0.1189 -0.1363 0.0758 0.0876 0.0870 0.1040 0.0921 0.0779 0.0908 0.0932 0.0773 0.0924 0.0910 0.1031 0.0909 0.1218 0.1217 0.1298 0.1302 0.1344 0.1268 0.1356 0.1266 0.1284 0.1269
va: 2.1217 2.0901 2.1058 3.1164 3.7139 3.7383 3.9389 3.9171 3.9088 3.9055 3.9246 4.1522 3.7960 3.7444 4.0284 4.1127 3.9612 3.9187 3.9636 3.9394 3.8224 4.0326 3.9441 3.9402 3.9455 3.9534 1.0341 0.9991 1.0037 1.0174 1.0011 1.0104 1.0059 1.0059 1.0103 1.0009 0.9996 1.0163 1.0027 1.0287 1.0306 1.0183 1.0012 1.0040 1.0128 1.0022 0.9988 0.9998 1.0000
dispcorr: -0.022970001 hartree
energy: -1132.698789334634
dipole: 27.36835 -26.71777 0.65058 12.27867 -13.11926 -0.84059 -13.99554 12.68933 -1.30621
magnitude: 1.68405 au
magnitude: 4.28052 debye
